program: Orca
programVersion: 5.0.2
elementType: Cl Cl O O O O N C C C C C C C C C C C C C C C C C C C H H H H H H H H H H H H H H H H H
charge: 0
multiplicity: 1
keywords: wb97x-d3
keywords: def2-TZVPP
keywords: def2/J RIJCOSX
keywords: DEFGRID2
keywords: scfconv7
keywords: smallprint printgap noloewdin
keywords: NOSOSCF
formula: C19H17Cl2NO4
InChI: InChI=1/C19H17Cl2NO4/c1-2-26-19(25)16(21)10-11-9-12(7-8-15(11)20)22-17(23)13-5-3-4-6-14(13)18(22)24/h7-10H,2-6H2,1H3
43 atoms
Cl -2.682004 3.032784 0.377954
Cl -3.090045 0.708133 -2.080769
O  3.64968 1.370709 1.779745
O  2.064041 -1.280986 -1.559171
O  -4.501076 -1.731577 0.569219
O  -5.312292 -1.00627 -1.383107
N  2.504187 0.233356 0.128262
C  6.692637 -1.82608 0.690642
C  6.45984 -2.136179 -0.787668
C  6.038976 -0.507514 1.109002
C  4.973176 -2.289583 -1.113456
C  4.676631 -0.426056 0.52776
C  4.207701 -1.211595 -0.441603
C  3.607934 0.521482 0.928717
C  2.808797 -0.816973 -0.736384
C  1.266124 0.901778 0.179245
C  0.095292 0.169684 0.305497
C  1.212633 2.287164 0.093728
C  -1.143669 0.801944 0.312377
C  -0.00931 2.932039 0.162188
C  -1.177243 2.193574 0.267239
C  -2.352311 -0.03342 0.380013
C  -3.248913 -0.146927 -0.597111
C  -4.467904 -1.00095 -0.525841
C  -5.642359 -2.589447 0.765282
C  -5.434369 -3.342921 2.052479
H  6.62954 0.346529 0.761339
H  5.996392 -0.419269 2.197241
H  4.598591 -3.260897 -0.773837
H  4.803634 -2.263429 -2.192536
H  6.28487 -2.638121 1.299345
H  7.762245 -1.785959 0.900951
H  6.879372 -1.330542 -1.397116
H  6.99083 -3.047173 -1.067157
H  0.130236 -0.908442 0.392063
H  2.114228 2.871747 -0.027553
H  -0.04997 4.011842 0.119676
H  -2.48596 -0.631871 1.273916
H  -6.548234 -1.981582 0.807063
H  -5.730213 -3.274346 -0.080135
H  -6.287046 -4.001986 2.216608
H  -4.537779 -3.962301 2.017801
H  -5.364048 -2.671485 2.908564
elementType: Cl O N C H
totalener: -2010.48544600 hartree
nucrepener: 2530.27270301 hartree
electener: -4540.75814901 hartree
oneelecener: -7787.24841481 hartree
twoeener: 3246.49026581 hartree
cpcmener: -0.03537487 hartree
kineticenergy: 2004.61805066 hartree
xcener: -146.366013173377 hartree
chargesum: 0.0000000
charge: -0.066875 -0.060708 -0.403684 -0.402982 -0.266634 -0.432059 -0.055946 -0.135541 -0.135311 -0.074982 -0.074220 -0.081677 -0.063605 0.322947 0.314926 0.123414 -0.165488 -0.205320 0.025865 -0.117722 0.042781 -0.036635 -0.041572 0.432545 0.034832 -0.247846 0.101180 0.093743 0.100495 0.093940 0.078122 0.080822 0.078284 0.081004 0.145431 0.155356 0.142202 0.152066 0.101938 0.099022 0.090433 0.088581 0.088877
qa: -0.0669 -0.0607 -0.4037 -0.4030 -0.2666 -0.4321 -0.0559 -0.1355 -0.1353 -0.0750 -0.0742 -0.0817 -0.0636 0.3229 0.3149 0.1234 -0.1655 -0.2053 0.0259 -0.1177 0.0428 -0.0366 -0.0416 0.4325 0.0348 -0.2478 0.1012 0.0937 0.1005 0.0939 0.0781 0.0808 0.0783 0.0810 0.1454 0.1554 0.1422 0.1521 0.1019 0.0990 0.0904 0.0886 0.0889
va: 1.2567 1.2693 2.1152 2.1147 2.1441 2.0817 3.0992 3.9154 3.9143 3.9198 3.9197 3.6919 3.6884 4.1918 4.1914 3.6890 4.0253 4.0527 3.7496 4.0039 3.9005 3.7756 3.9900 4.2363 3.8418 3.9672 1.0043 1.0156 1.0046 1.0157 1.0067 1.0096 1.0067 1.0095 1.0170 1.0066 1.0074 1.0154 0.9952 0.9957 1.0070 1.0034 1.0031
dispcorr: -0.020720463 hartree
energy: -2010.506166462518
dipole: 27.26715 -24.78573 2.48141 -28.12819 26.42871 -1.69947 11.58707 -10.01156 1.57551
magnitude: 3.39527 au
magnitude: 8.63009 debye
