program: Orca
programVersion: 5.0.2
elementType: Cl Cl O O O O N C C C C C C C C C C C C C C C C C C C H H H H H H H H H H H H H H H H H
charge: 0
multiplicity: 1
keywords: wb97x-d3
keywords: def2-TZVPP
keywords: def2/J RIJCOSX
keywords: DEFGRID2
keywords: scfconv7
keywords: smallprint printgap noloewdin
keywords: NOSOSCF
formula: C19H17Cl2NO4
InChI: InChI=1/C19H17Cl2NO4/c1-2-26-19(25)16(21)10-11-9-12(7-8-15(11)20)22-17(23)13-5-3-4-6-14(13)18(22)24/h7-10H,2-6H2,1H3
43 atoms
Cl -2.681397 2.82744 -0.490219
Cl -3.304979 0.362515 1.643247
O  2.278178 -1.360422 1.393024
O  3.705057 1.578428 -1.772572
O  -5.291627 -1.33602 0.617541
O  -4.282667 -2.029111 -1.252645
N  2.630266 0.278594 -0.195091
C  6.569404 -2.264292 0.155572
C  7.175946 -0.908182 -0.20158
C  5.265743 -2.121846 0.944542
C  6.244633 -0.081863 -1.090672
C  4.433422 -1.056311 0.334347
C  4.859158 -0.173576 -0.569444
C  3.000647 -0.791024 0.617547
C  3.720537 0.693811 -0.957194
C  1.353274 0.872107 -0.230084
C  0.231009 0.095607 -0.470543
C  1.220012 2.240278 -0.029138
C  -1.041143 0.663728 -0.492091
C  -0.029505 2.827114 -0.105997
C  -1.150195 2.044717 -0.337848
C  -2.190783 -0.219675 -0.722074
C  -3.209715 -0.416005 0.111821
C  -4.311985 -1.351582 -0.254282
C  -6.438681 -2.170804 0.365459
C  -7.462588 -1.874018 1.429996
H  5.468656 -1.871131 1.990784
H  4.716994 -3.066621 0.963547
H  6.27066 -0.442291 -2.124173
H  6.56588 0.962038 -1.129003
H  6.373803 -2.825429 -0.762971
H  7.28289 -2.853031 0.733961
H  7.385408 -0.351204 0.716421
H  8.132857 -1.047969 -0.706571
H  0.329933 -0.96814 -0.645176
H  2.083175 2.856633 0.182206
H  -0.129101 3.896393 0.020733
H  -2.183207 -0.799786 -1.638594
H  -6.834099 -1.956251 -0.6294
H  -6.132875 -3.218951 0.392341
H  -8.336887 -2.504098 1.264871
H  -7.082868 -2.087118 2.429959
H  -7.790744 -0.834477 1.394499
elementType: Cl O N C H
totalener: -2010.48550473 hartree
nucrepener: 2518.00462793 hartree
electener: -4528.49013266 hartree
oneelecener: -7762.92697059 hartree
twoeener: 3234.43683793 hartree
cpcmener: -0.03332093 hartree
kineticenergy: 2004.60560062 hartree
xcener: -146.363626432329 hartree
chargesum: -0.0000000
charge: -0.066428 -0.061033 -0.404451 -0.404048 -0.266494 -0.450734 -0.057990 -0.135506 -0.134905 -0.074019 -0.075546 -0.071055 -0.074577 0.318788 0.320374 0.119721 -0.163160 -0.210423 0.025792 -0.112804 0.037936 -0.031089 -0.053406 0.464416 0.035624 -0.246969 0.101178 0.094218 0.101532 0.093468 0.077951 0.080754 0.077911 0.080707 0.147686 0.156380 0.141816 0.146946 0.099441 0.104960 0.089063 0.089358 0.088621
qa: -0.0664 -0.0610 -0.4045 -0.4040 -0.2665 -0.4507 -0.0580 -0.1355 -0.1349 -0.0740 -0.0755 -0.0711 -0.0746 0.3188 0.3204 0.1197 -0.1632 -0.2104 0.0258 -0.1128 0.0379 -0.0311 -0.0534 0.4644 0.0356 -0.2470 0.1012 0.0942 0.1015 0.0935 0.0780 0.0808 0.0779 0.0807 0.1477 0.1564 0.1418 0.1469 0.0994 0.1050 0.0891 0.0894 0.0886
va: 1.2569 1.2678 2.1136 2.1148 2.1700 2.0651 3.0886 3.9147 3.9143 3.9198 3.9195 3.6948 3.6894 4.1904 4.1898 3.6891 4.0348 4.0578 3.7700 3.9959 3.8999 3.7996 4.0009 4.1711 3.8401 3.9716 1.0051 1.0151 1.0051 1.0155 1.0067 1.0094 1.0067 1.0097 1.0149 1.0052 1.0073 1.0240 0.9969 0.9946 1.0066 1.0031 1.0035
dispcorr: -0.020610338 hartree
energy: -2010.506115069624
dipole: 23.03654 -21.32189 1.71465 -20.42919 19.69333 -0.73586 0.52342 -0.12363 0.39979
magnitude: 1.90823 au
magnitude: 4.85032 debye
