program: Orca
programVersion: 5.0.2
elementType: Cl Cl O O O O N C C C C C C C C C C C C C C C C C C C H H H H H H H H H H H H H H H H H
charge: 0
multiplicity: 1
keywords: wb97x-d3
keywords: def2-TZVPP
keywords: def2/J RIJCOSX
keywords: DEFGRID2
keywords: scfconv7
keywords: smallprint printgap noloewdin
keywords: NOSOSCF
formula: C19H17Cl2NO4
InChI: InChI=1/C19H17Cl2NO4/c1-2-26-19(25)16(21)10-11-9-12(7-8-15(11)20)22-17(23)13-5-3-4-6-14(13)18(22)24/h7-10H,2-6H2,1H3
43 atoms
Cl -2.813598 3.238929 -0.461659
Cl -1.822645 -1.816137 -1.389373
O  3.347246 1.682227 1.731631
O  2.065524 -1.138975 -1.597289
O  -5.05854 -0.767877 0.442141
O  -4.44012 -2.672032 -0.551666
N  2.348414 0.441872 0.061241
C  6.587018 -1.411028 0.916164
C  6.445506 -1.763043 -0.564111
C  5.843639 -0.122215 1.271258
C  4.986992 -2.009776 -0.95329
C  4.514026 -0.119375 0.613257
C  4.134845 -0.952742 -0.355856
C  3.388959 0.799766 0.914987
C  2.74231 -0.62284 -0.747488
C  1.113254 1.111277 -0.040257
C  -0.066505 0.398862 0.099335
C  1.081742 2.476276 -0.294796
C  -1.303087 1.027543 -0.039532
C  -0.134981 3.125597 -0.398562
C  -1.310259 2.404398 -0.276953
C  -2.563353 0.300788 0.110466
C  -2.881022 -0.893766 -0.392589
C  -4.202166 -1.552233 -0.180028
C  -6.384611 -1.277543 0.683842
C  -7.205822 -0.161116 1.273858
H  6.408601 0.75579 0.94119
H  5.735115 -0.018487 2.353513
H  4.650561 -2.989271 -0.597874
H  4.867733 -2.026974 -2.039231
H  6.192115 -2.23194 1.52128
H  7.640785 -1.30869 1.178945
H  6.845175 -0.945736 -1.171338
H  7.041299 -2.646161 -0.798344
H  -0.026121 -0.651431 0.350358
H  1.998052 3.036353 -0.423655
H  -0.164325 4.18875 -0.593422
H  -3.334899 0.798783 0.685517
H  -6.817521 -1.623728 -0.256362
H  -6.325208 -2.127971 1.365964
H  -7.276243 0.689057 0.594748
H  -8.217245 -0.525786 1.454239
H  -6.801865 0.183439 2.225993
elementType: Cl O N C H
totalener: -2010.48766988 hartree
nucrepener: 2534.02639118 hartree
electener: -4544.51406106 hartree
oneelecener: -7794.76020258 hartree
twoeener: 3250.24614152 hartree
cpcmener: -0.03414432 hartree
kineticenergy: 2004.60133737 hartree
xcener: -146.363913138416 hartree
chargesum: -0.0000000
charge: -0.070952 -0.064399 -0.403785 -0.402922 -0.266426 -0.433077 -0.059299 -0.136188 -0.135148 -0.071778 -0.074352 -0.088727 -0.058277 0.324655 0.311695 0.097343 -0.187233 -0.185139 0.112794 -0.130011 0.041704 -0.092494 -0.034275 0.441522 0.033636 -0.248191 0.100836 0.094200 0.100230 0.093158 0.078005 0.081207 0.078256 0.080673 0.161078 0.157706 0.142087 0.142617 0.097761 0.103329 0.088221 0.091051 0.088907
qa: -0.0710 -0.0644 -0.4038 -0.4029 -0.2664 -0.4331 -0.0593 -0.1362 -0.1351 -0.0718 -0.0744 -0.0887 -0.0583 0.3247 0.3117 0.0973 -0.1872 -0.1851 0.1128 -0.1300 0.0417 -0.0925 -0.0343 0.4415 0.0336 -0.2482 0.1008 0.0942 0.1002 0.0932 0.0780 0.0812 0.0783 0.0807 0.1611 0.1577 0.1421 0.1426 0.0978 0.1033 0.0882 0.0911 0.0889
va: 1.2577 1.2695 2.1152 2.1148 2.1425 2.0798 3.0883 3.9153 3.9135 3.9180 3.9198 3.6951 3.6895 4.1940 4.1923 3.7436 4.0511 4.0629 3.6323 4.0046 3.9750 3.8495 3.9892 4.2310 3.8431 3.9668 1.0047 1.0152 1.0046 1.0160 1.0069 1.0093 1.0070 1.0096 1.0159 1.0030 1.0079 1.0300 0.9966 0.9946 1.0038 1.0070 1.0028
dispcorr: -0.020898496 hartree
energy: -2010.508568372435
dipole: 18.05121 -16.62075 1.43046 -9.33616 9.97301 0.63685 10.13578 -9.14130 0.99449
magnitude: 1.85494 au
magnitude: 4.71487 debye
