program: Orca
programVersion: 5.0.2
elementType: Cl Cl O O O O N C C C C C C C C C C C C C C C C C C C H H H H H H H H H H H H H H H H H
charge: 0
multiplicity: 1
keywords: wb97x-d3
keywords: def2-TZVPP
keywords: def2/J RIJCOSX
keywords: DEFGRID2
keywords: scfconv7
keywords: smallprint printgap noloewdin
keywords: NOSOSCF
formula: C19H17Cl2NO4
InChI: InChI=1/C19H17Cl2NO4/c1-2-26-19(25)16(21)10-11-9-12(7-8-15(11)20)22-17(23)13-5-3-4-6-14(13)18(22)24/h7-10H,2-6H2,1H3
43 atoms
Cl -2.56926 3.680437 -0.63518
Cl -2.169266 -1.541196 -0.869767
O  1.799367 -1.357717 -1.379222
O  3.59321 1.890628 1.267054
O  -4.760386 -1.928876 0.146498
O  -5.024553 -0.018734 1.274463
N  2.350631 0.480068 -0.083116
C  6.143888 -2.274328 -0.412642
C  6.392842 -1.679568 0.973633
C  4.650039 -2.405536 -0.714822
C  5.822741 -0.265088 1.097597
C  3.951518 -1.164431 -0.296806
C  4.470907 -0.22097 0.486343
C  2.574068 -0.761142 -0.687661
C  3.475822 0.872261 0.646444
C  1.171941 1.24054 -0.21367
C  -0.052625 0.675463 0.100789
C  1.238515 2.555627 -0.653516
C  -1.234801 1.402634 -0.025746
C  0.080114 3.300956 -0.765653
C  -1.141148 2.728226 -0.455811
C  -2.530682 0.839327 0.346126
C  -3.011343 -0.37534 0.073025
C  -4.371179 -0.741331 0.570914
C  -6.051899 -2.380606 0.56538
C  -6.272059 -3.751208 -0.027393
H  4.220188 -3.260277 -0.182899
H  4.476021 -2.600195 -1.775128
H  6.470827 0.461366 0.596836
H  5.777115 0.052227 2.14167
H  6.608692 -1.635509 -1.168975
H  6.624544 -3.250169 -0.494474
H  5.929819 -2.320449 1.729273
H  7.461572 -1.667151 1.191402
H  -0.091964 -0.337402 0.472942
H  2.189231 3.002798 -0.906549
H  0.123529 4.326819 -1.102562
H  -3.199806 1.485599 0.902857
H  -6.095267 -2.410108 1.656539
H  -6.815642 -1.676011 0.228546
H  -5.519936 -4.460501 0.316223
H  -7.249399 -4.125618 0.276183
H  -6.246494 -3.725061 -1.116125
totalener: -2010.46106756 hartree
nucrepener: 2528.78427770 hartree
electener: -4539.24534527 hartree
oneelecener: -7784.08964211 hartree
twoeener: 3244.84429685 hartree
kineticenergy: 2004.66266643 hartree
xcener: -146.367278820797 hartree
chargesum: 0.0000000
charge: -0.056932 -0.040155 -0.304170 -0.309028 -0.255310 -0.364025 -0.090561 -0.135429 -0.136434 -0.076425 -0.074897 -0.077394 -0.098806 0.242102 0.252880 0.112062 -0.122204 -0.137503 0.070040 -0.128482 0.045595 -0.075916 -0.075995 0.405291 0.028573 -0.227976 0.092851 0.094920 0.092612 0.095195 0.076032 0.080421 0.076525 0.080898 0.129592 0.124009 0.118198 0.139958 0.089944 0.090294 0.084941 0.077877 0.086831
qa: -0.0569 -0.0402 -0.3042 -0.3090 -0.2553 -0.3640 -0.0906 -0.1354 -0.1364 -0.0764 -0.0749 -0.0774 -0.0988 0.2421 0.2529 0.1121 -0.1222 -0.1375 0.0700 -0.1285 0.0456 -0.0759 -0.0760 0.4053 0.0286 -0.2280 0.0929 0.0949 0.0926 0.0952 0.0760 0.0804 0.0765 0.0809 0.1296 0.1240 0.1182 0.1400 0.0899 0.0903 0.0849 0.0779 0.0868
va: 1.2726 1.2929 2.2077 2.2056 2.1633 2.1473 3.0903 3.8966 3.8970 3.9270 3.9265 3.6349 3.6430 4.2602 4.2585 3.8178 4.0586 4.0865 3.7189 4.0475 4.0142 3.8385 4.0366 4.2036 3.8778 3.9588 1.0084 1.0190 1.0087 1.0188 1.0089 1.0117 1.0087 1.0116 1.0273 1.0140 1.0167 1.0388 0.9986 0.9984 1.0057 1.0079 1.0055
dispcorr: -0.020773840 hartree
energy: -2010.481841402263
dipole: 20.29159 -18.86789 1.42370 -23.95582 22.78218 -1.17363 5.42835 -5.49721 -0.06886
magnitude: 1.84637 au
magnitude: 4.69310 debye
