program: Orca
programVersion: 5.0.2
elementType: Cl Cl F F F O O O N N N C C C C C C C C C C C C C C C H H H H H H H H H H H H H H
charge: 0
multiplicity: 1
keywords: wb97x-d3
keywords: def2-TZVPP
keywords: def2/J RIJCOSX
keywords: DEFGRID2
keywords: scfconv7
keywords: smallprint printgap noloewdin
keywords: NOSOSCF
formula: C15H14Cl2F3N3O3
InChI: InChI=1/C15H14Cl2F3N3O3/c1-3-26-13(24)10(17)4-8-5-12(11(18)6-9(8)16)23-15(25)22(14(19)20)7(2)21-23/h5-6,10,14H,3-4H2,1-2H3
40 atoms
Cl -3.90036 0.426445 3.469525
Cl -3.656064 -1.335014 -1.268506
F  1.022774 -0.496923 -2.808031
F  6.017275 -1.35563 0.868966
F  6.30064 0.182416 -0.621247
O  -2.949407 1.755424 -0.002089
O  3.082032 -1.952673 -1.46493
O  -4.95122 1.265462 0.867745
N  2.049363 -0.260399 -0.242412
N  4.180779 -0.414636 -0.085929
N  2.442497 0.687351 0.661046
C  -1.556561 -0.842763 0.379793
C  -2.476237 -0.864657 1.567186
C  0.69019 -0.509389 -0.47817
C  -0.203101 -0.602446 0.578098
C  -2.925016 0.544692 1.980004
C  3.091482 -1.00248 -0.710009
C  -1.988673 -1.022243 -0.931858
C  3.719557 0.590542 0.74433
C  0.203026 -0.650867 -1.769218
C  -1.123726 -0.933629 -2.008509
C  5.512857 -0.858346 -0.280543
C  4.569587 1.442868 1.599874
C  -3.748744 1.229971 0.903195
C  -3.535456 2.362181 -1.171915
C  -2.409622 2.75397 -2.093047
H  -1.94346 -1.292856 2.416175
H  -3.351984 -1.488309 1.390235
H  0.163268 -0.480796 1.5898
H  -2.052089 1.15425 2.214796
H  -1.473825 -1.051079 -3.025071
H  5.547586 -1.619527 -1.057257
H  3.934093 2.094219 2.194168
H  5.235092 2.066284 1.003732
H  5.179504 0.846675 2.277563
H  -4.207443 1.650619 -1.654427
H  -4.119899 3.232256 -0.868128
H  -2.828383 3.211868 -2.988643
H  -1.740841 3.479105 -1.629743
H  -1.825551 1.887325 -2.404054
elementType: Cl F O N C H
totalener: -2190.10742364 hartree
nucrepener: 2784.37053059 hartree
electener: -4974.47795424 hartree
oneelecener: -8550.36585781 hartree
twoeener: 3575.88790358 hartree
cpcmener: -0.04441842 hartree
kineticenergy: 2183.91092946 hartree
xcener: -156.799150360137 hartree
chargesum: -0.0000000
charge: -0.151024 -0.073289 -0.203012 -0.204673 -0.204146 -0.264483 -0.520603 -0.440956 0.049411 -0.153762 -0.312974 -0.004600 -0.153030 0.012408 -0.120159 0.099539 0.412038 0.021527 0.221830 0.232573 -0.131218 0.398612 -0.249829 0.325862 0.012533 -0.252927 0.115003 0.128746 0.140693 0.143349 0.139593 0.129839 0.106620 0.122138 0.120290 0.104985 0.121804 0.096277 0.093364 0.091650
qa: -0.1510 -0.0733 -0.2030 -0.2047 -0.2041 -0.2645 -0.5206 -0.4410 0.0494 -0.1538 -0.3130 -0.0046 -0.1530 0.0124 -0.1202 0.0995 0.4120 0.0215 0.2218 0.2326 -0.1312 0.3986 -0.2498 0.3259 0.0125 -0.2529 0.1150 0.1287 0.1407 0.1433 0.1396 0.1298 0.1066 0.1221 0.1203 0.1050 0.1218 0.0963 0.0934 0.0916
va: 1.1518 1.2541 1.0944 1.0788 1.0806 2.1345 2.0022 2.0559 3.1876 3.2593 2.9261 3.6582 3.8363 3.7538 4.0281 3.9363 4.2831 3.8674 3.9879 4.0597 3.9229 4.1755 3.9238 4.2455 3.8091 3.9602 1.0234 1.0242 1.0190 1.0250 1.0110 0.9979 1.0135 0.9985 1.0022 1.0042 0.9983 1.0083 1.0032 0.9974
dispcorr: -0.023127839 hartree
energy: -2190.130551483844
dipole: -5.51472 7.58513 2.07041 15.87426 -14.69192 1.18234 -1.16419 1.28552 0.12133
magnitude: 2.38731 au
magnitude: 6.06807 debye
