program: Orca
programVersion: 5.0.2
elementType: Cl Cl F F F O O O N N N C C C C C C C C C C C C C C C H H H H H H H H H H H H H H
charge: 0
multiplicity: 1
keywords: wb97x-d3
keywords: def2-TZVPP
keywords: def2/J RIJCOSX
keywords: DEFGRID2
keywords: scfconv7
keywords: smallprint printgap noloewdin
keywords: NOSOSCF
formula: C15H14Cl2F3N3O3
InChI: InChI=1/C15H14Cl2F3N3O3/c1-3-26-13(24)10(17)4-8-5-12(11(18)6-9(8)16)23-15(25)22(14(19)20)7(2)21-23/h5-6,10,14H,3-4H2,1-2H3
40 atoms
Cl -4.05404 0.804512 3.146125
Cl -3.637326 -1.602401 -1.418702
F  1.1221 -0.808917 -2.726233
F  5.939367 -1.106906 1.234998
F  6.210224 0.038872 -0.578408
O  -3.879823 1.421075 0.112235
O  3.037888 -2.21196 -1.053356
O  -2.157928 2.663956 0.822795
N  1.979803 -0.340226 -0.161448
N  4.102366 -0.458762 0.075251
N  2.347437 0.752383 0.572789
C  -1.659582 -0.875427 0.307302
C  -2.647822 -0.784887 1.43843
C  0.6342 -0.610284 -0.441287
C  -0.31769 -0.610763 0.562931
C  -2.692224 0.639085 1.983724
C  3.031143 -1.14712 -0.46977
C  -2.01142 -1.183933 -1.006091
C  3.621495 0.674135 0.705644
C  0.227732 -0.869315 -1.740957
C  -1.080215 -1.180678 -2.034195
C  5.44101 -0.910216 -0.00472
C  4.455468 1.659149 1.422608
C  -2.873269 1.696464 0.910983
C  -4.166167 2.320033 -0.978843
C  -3.251702 2.105244 -2.161921
H  -2.349391 -1.450699 2.249352
H  -3.641446 -1.09157 1.121085
H  -0.004654 -0.402619 1.578601
H  -1.785256 0.874831 2.53756
H  -1.36735 -1.399638 -3.053813
H  5.499793 -1.832584 -0.579312
H  5.155524 2.151065 0.748574
H  5.027697 1.190136 2.221674
H  3.812602 2.417245 1.861703
H  -5.196999 2.097153 -1.245577
H  -4.127542 3.350682 -0.625367
H  -3.339702 1.09491 -2.558433
H  -3.545115 2.795762 -2.953284
H  -2.20667 2.299672 -1.924602
elementType: Cl F O N C H
totalener: -2190.10572668 hartree
nucrepener: 2791.33382922 hartree
electener: -4981.43955590 hartree
oneelecener: -8564.69428782 hartree
twoeener: 3583.25473192 hartree
cpcmener: -0.04205257 hartree
kineticenergy: 2183.92134192 hartree
xcener: -156.801028836060 hartree
chargesum: 0.0000000
charge: -0.154033 -0.071774 -0.203405 -0.205255 -0.204652 -0.264608 -0.523850 -0.455084 0.046205 -0.154293 -0.309832 0.021868 -0.116783 0.022169 -0.152457 0.087919 0.412371 -0.015355 0.216961 0.233573 -0.109429 0.401095 -0.248728 0.355366 0.014875 -0.253010 0.125347 0.098550 0.141567 0.141976 0.137579 0.130508 0.121896 0.120313 0.106526 0.116527 0.102737 0.081509 0.112465 0.092642
qa: -0.1540 -0.0718 -0.2034 -0.2053 -0.2047 -0.2646 -0.5238 -0.4551 0.0462 -0.1543 -0.3098 0.0219 -0.1168 0.0222 -0.1525 0.0879 0.4124 -0.0154 0.2170 0.2336 -0.1094 0.4011 -0.2487 0.3554 0.0149 -0.2530 0.1253 0.0986 0.1416 0.1420 0.1376 0.1305 0.1219 0.1203 0.1065 0.1165 0.1027 0.0815 0.1125 0.0926
va: 1.1455 1.2454 1.0971 1.0800 1.0795 2.1609 1.9998 2.0374 3.1864 3.2614 2.9266 3.6856 3.8455 3.7243 4.0288 3.9189 4.2853 3.8834 3.9932 4.0681 3.9260 4.1722 3.9249 4.2183 3.8408 3.9054 1.0149 1.0457 1.0170 1.0236 1.0115 0.9982 0.9995 1.0024 1.0133 0.9952 1.0095 1.0116 1.0089 1.0127
dispcorr: -0.023462786 hartree
energy: -2190.129189463111
dipole: -9.57643 9.78180 0.20538 14.39737 -14.08502 0.31235 -1.13589 1.36337 0.22748
magnitude: 0.43760 au
magnitude: 1.11228 debye
