program: Orca
programVersion: 5.0.2
elementType: Cl Cl F F F O O O N N N C C C C C C C C C C C C C C C H H H H H H H H H H H H H H
charge: 0
multiplicity: 1
keywords: wb97x-d3
keywords: def2-TZVPP
keywords: def2/J RIJCOSX
keywords: DEFGRID2
keywords: scfconv7
keywords: smallprint printgap noloewdin
keywords: NOSOSCF
formula: C15H14Cl2F3N3O3
InChI: InChI=1/C15H14Cl2F3N3O3/c1-3-26-13(24)10(17)4-8-5-12(11(18)6-9(8)16)23-15(25)22(14(19)20)7(2)21-23/h5-6,10,14H,3-4H2,1-2H3
40 atoms
Cl -4.866325 1.542916 -1.470729
Cl -3.533409 -2.543219 0.362759
F  1.326386 -2.718076 1.55498
F  6.298797 -0.188307 0.036659
F  5.673786 0.138196 -2.005171
O  -3.213973 2.423555 1.189181
O  3.144191 -2.440242 -0.777282
O  -1.828274 2.508243 -0.562659
N  2.000566 -0.559806 -0.02302
N  4.086038 -0.320366 -0.444809
N  2.289776 0.758667 0.193546
C  -1.652602 -0.828847 -0.571358
C  -2.719989 -0.1192 -1.358137
C  0.681733 -1.029248 0.059079
C  -0.333447 -0.399887 -0.643412
C  -3.538575 0.817993 -0.486498
C  3.077422 -1.271954 -0.452323
C  -1.920229 -1.933718 0.236715
C  3.540941 0.891584 -0.060016
C  0.36475 -2.116927 0.856437
C  -0.927167 -2.587576 0.947548
C  5.405029 -0.583491 -0.893698
C  4.291298 2.156786 0.068972
C  -2.746511 2.003628 0.034458
C  -2.609984 3.592998 1.782426
C  -3.300461 3.846951 3.096202
H  -3.396209 -0.842716 -1.814851
H  -2.262056 0.442672 -2.171601
H  -0.085786 0.44072 -1.277688
H  -4.020174 0.290389 0.335207
H  -1.149254 -3.440721 1.574557
H  5.529259 -1.643725 -1.104125
H  3.600488 2.951679 0.337187
H  4.78206 2.428801 -0.864457
H  5.052429 2.08798 0.845417
H  -1.543355 3.413702 1.926366
H  -2.727939 4.440096 1.104594
H  -2.866753 4.734462 3.556327
H  -4.366867 4.029082 2.963636
H  -3.169362 3.015376 3.788453
elementType: Cl F O N C H
totalener: -2190.10946323 hartree
nucrepener: 2729.32350505 hartree
electener: -4919.43296828 hartree
oneelecener: -8440.93178662 hartree
twoeener: 3521.49881834 hartree
cpcmener: -0.03921233 hartree
kineticenergy: 2183.88961034 hartree
xcener: -156.791213354994 hartree
chargesum: 0.0000000
charge: -0.152675 -0.071800 -0.202628 -0.203779 -0.205981 -0.268621 -0.525106 -0.460818 0.044839 -0.154179 -0.311115 0.008826 -0.165764 0.007047 -0.128592 0.097096 0.413448 0.033801 0.219204 0.233816 -0.133623 0.400012 -0.249223 0.378965 0.042388 -0.247973 0.121426 0.117044 0.139560 0.131687 0.140036 0.129772 0.107174 0.119831 0.122000 0.101459 0.103986 0.089913 0.088860 0.089689
qa: -0.1527 -0.0718 -0.2026 -0.2038 -0.2060 -0.2686 -0.5251 -0.4608 0.0448 -0.1542 -0.3111 0.0088 -0.1658 0.0070 -0.1286 0.0971 0.4134 0.0338 0.2192 0.2338 -0.1336 0.4000 -0.2492 0.3790 0.0424 -0.2480 0.1214 0.1170 0.1396 0.1317 0.1400 0.1298 0.1072 0.1198 0.1220 0.1015 0.1040 0.0899 0.0889 0.0897
va: 1.1428 1.2535 1.0986 1.0810 1.0781 2.1719 1.9976 2.0353 3.1776 3.2600 2.9202 3.6538 3.8436 3.7508 3.9920 3.9189 4.2858 3.9182 3.9914 4.0976 3.9720 4.1743 3.9239 4.1682 3.8293 3.9717 1.0237 1.0276 1.0296 1.0410 1.0104 0.9982 1.0132 1.0030 0.9986 0.9961 0.9954 1.0065 1.0035 1.0032
dispcorr: -0.020565289 hartree
energy: -2190.130028517187
dipole: -7.36495 7.59382 0.22887 24.87360 -23.54860 1.32501 10.73492 -9.54151 1.19341
magnitude: 1.79785 au
magnitude: 4.56977 debye
