program: Orca
programVersion: 5.0.2
elementType: Cl Cl F F F O O O N N N C C C C C C C C C C C C C C C H H H H H H H H H H H H H H
charge: 0
multiplicity: 1
keywords: wb97x-d3
keywords: def2-TZVPP
keywords: def2/J RIJCOSX
keywords: DEFGRID2
keywords: scfconv7
keywords: smallprint printgap noloewdin
keywords: NOSOSCF
formula: C15H14Cl2F3N3O3
InChI: InChI=1/C15H14Cl2F3N3O3/c1-3-26-13(24)10(17)4-8-5-12(11(18)6-9(8)16)23-15(25)22(14(19)20)7(2)21-23/h5-6,10,14H,3-4H2,1-2H3
40 atoms
Cl -4.998277 1.452734 -1.437217
Cl -3.570381 -2.65705 0.402087
F  1.301998 -2.626761 1.549296
F  6.152836 -0.061977 0.203687
F  5.634376 0.379123 -1.844792
O  -2.821853 2.21668 1.169381
O  3.098908 -2.317301 -0.759348
O  -2.089759 2.57323 -0.912226
N  1.879722 -0.466885 -0.051367
N  3.969597 -0.171268 -0.405958
N  2.126692 0.857769 0.178182
C  -1.762148 -0.895472 -0.586561
C  -2.865368 -0.232194 -1.364189
C  0.580576 -0.986553 0.036216
C  -0.462418 -0.411383 -0.67223
C  -3.620385 0.769774 -0.502274
C  2.988737 -1.150438 -0.441347
C  -1.98142 -1.995786 0.24222
C  3.381214 1.024538 -0.035337
C  0.312523 -2.077097 0.847648
C  -0.957682 -2.600487 0.952715
C  5.311552 -0.404706 -0.793661
C  4.094498 2.308542 0.114216
C  -2.750671 1.953156 -0.116045
C  -2.051532 3.330778 1.67148
C  -2.338842 3.462939 3.143225
H  -3.571916 -0.973604 -1.736756
H  -2.448666 0.276088 -2.233484
H  -0.253838 0.430669 -1.31911
H  -4.047807 0.297441 0.380361
H  -1.140701 -3.452895 1.593138
H  5.45331 -1.451104 -1.054694
H  4.865951 2.245634 0.88057
H  3.384269 3.077225 0.406498
H  4.566545 2.614857 -0.818255
H  -0.992239 3.140516 1.490385
H  -2.335215 4.236507 1.13335
H  -2.052319 2.567464 3.694219
H  -1.760678 4.2971 3.539693
H  -3.392274 3.669601 3.331326
elementType: Cl F O N C H
totalener: -2190.10968040 hartree
nucrepener: 2749.86706909 hartree
electener: -4939.97674949 hartree
oneelecener: -8481.66955865 hartree
twoeener: 3541.69280916 hartree
cpcmener: -0.03955721 hartree
kineticenergy: 2183.90265500 hartree
xcener: -156.793541382293 hartree
chargesum: -0.0000000
charge: -0.152587 -0.070370 -0.202444 -0.204284 -0.205486 -0.264330 -0.524878 -0.460795 0.049413 -0.154321 -0.316405 0.027822 -0.173882 0.010640 -0.155045 0.111102 0.410965 0.031830 0.225084 0.234453 -0.130963 0.400542 -0.251298 0.367182 0.042769 -0.247977 0.116237 0.121554 0.146970 0.124842 0.140164 0.129216 0.121832 0.107300 0.120833 0.101678 0.102872 0.089936 0.090520 0.089306
qa: -0.1526 -0.0704 -0.2024 -0.2043 -0.2055 -0.2643 -0.5249 -0.4608 0.0494 -0.1543 -0.3164 0.0278 -0.1739 0.0106 -0.1550 0.1111 0.4110 0.0318 0.2251 0.2345 -0.1310 0.4005 -0.2513 0.3672 0.0428 -0.2480 0.1162 0.1216 0.1470 0.1248 0.1402 0.1292 0.1218 0.1073 0.1208 0.1017 0.1029 0.0899 0.0905 0.0893
va: 1.1427 1.2543 1.0991 1.0797 1.0793 2.1678 1.9986 2.0383 3.1706 3.2600 2.9024 3.6521 3.8669 3.7486 3.9947 3.9361 4.2857 3.9224 3.9739 4.0927 3.9737 4.1748 3.9269 4.1688 3.8269 3.9721 1.0274 1.0283 1.0226 1.0432 1.0105 0.9989 0.9996 1.0125 1.0017 0.9979 0.9966 1.0032 1.0065 1.0032
dispcorr: -0.020996810 hartree
energy: -2190.130677210343
dipole: -4.07420 4.63991 0.56571 23.42834 -22.26547 1.16287 10.38570 -9.04968 1.33602
magnitude: 1.85936 au
magnitude: 4.72612 debye
