program: Orca
programVersion: 5.0.2
elementType: Cl Cl F F F O O O N N N C C C C C C C C C C C C C C C H H H H H H H H H H H H H H
charge: 0
multiplicity: 1
keywords: wb97x-d3
keywords: def2-TZVPP
keywords: def2/J RIJCOSX
keywords: DEFGRID2
keywords: scfconv7
keywords: smallprint printgap noloewdin
keywords: NOSOSCF
formula: C15H14Cl2F3N3O3
InChI: InChI=1/C15H14Cl2F3N3O3/c1-3-26-13(24)10(17)4-8-5-12(11(18)6-9(8)16)23-15(25)22(14(19)20)7(2)21-23/h5-6,10,14H,3-4H2,1-2H3
40 atoms
Cl -1.782903 2.335172 -0.079972
Cl -3.558502 -2.129461 -0.471329
F  1.241857 -3.124463 -1.481227
F  6.423609 -0.920002 -0.78019
F  5.773203 1.139366 -0.828329
O  -4.735217 2.806567 0.56418
O  2.767168 -0.758255 -2.241307
O  -4.107392 1.958276 2.534693
N  2.208026 -1.022619 0.002244
N  4.230422 -0.477917 -0.435057
N  2.832713 -0.857999 1.206542
C  -1.4495 -0.763933 0.546859
C  -2.400471 0.083182 1.339922
C  0.833912 -1.287916 -0.079919
C  -0.083396 -0.520527 0.618756
C  -3.038888 1.190391 0.51989
C  3.02418 -0.76177 -1.054334
C  -1.87111 -1.793722 -0.291978
C  4.044094 -0.53396 0.934116
C  0.368042 -2.333976 -0.860002
C  -0.97906 -2.58636 -0.994798
C  5.401415 -0.119351 -1.146235
C  5.09242 -0.277803 1.942427
C  -4.014779 2.021108 1.333926
C  -5.669722 3.707124 1.195422
C  -6.311739 4.532154 0.111759
H  -1.87351 0.514686 2.190626
H  -3.204204 -0.533959 1.747632
H  0.275696 0.28488 1.245612
H  -3.542203 0.79942 -0.364819
H  -1.316341 -3.400572 -1.621737
H  5.236336 -0.194874 -2.219065
H  5.894155 -1.012456 1.875442
H  4.653957 -0.339947 2.934589
H  5.529398 0.712617 1.822292
H  -6.414361 3.127495 1.743295
H  -5.136202 4.340073 1.906494
H  -7.029088 5.214495 0.56679
H  -5.578053 5.131373 -0.42734
H  -6.851332 3.911211 -0.603159
elementType: Cl F O N C H
totalener: -2190.10896024 hartree
nucrepener: 2691.86166380 hartree
electener: -4881.97062404 hartree
oneelecener: -8366.18408316 hartree
twoeener: 3484.21345912 hartree
cpcmener: -0.04002974 hartree
kineticenergy: 2183.91655469 hartree
xcener: -156.797742652803 hartree
chargesum: -0.0000000
charge: -0.153857 -0.075258 -0.203955 -0.204385 -0.205324 -0.273249 -0.524873 -0.459587 0.042577 -0.152851 -0.310327 0.030564 -0.183243 -0.006337 -0.121621 0.108070 0.412560 0.030767 0.218300 0.228011 -0.132226 0.400123 -0.248642 0.380363 0.036788 -0.248975 0.118667 0.131187 0.140562 0.133417 0.139724 0.129947 0.121824 0.106473 0.119838 0.103720 0.102543 0.090259 0.088877 0.089548
qa: -0.1539 -0.0753 -0.2040 -0.2044 -0.2053 -0.2732 -0.5249 -0.4596 0.0426 -0.1529 -0.3103 0.0306 -0.1832 -0.0063 -0.1216 0.1081 0.4126 0.0308 0.2183 0.2280 -0.1322 0.4001 -0.2486 0.3804 0.0368 -0.2490 0.1187 0.1312 0.1406 0.1334 0.1397 0.1299 0.1218 0.1065 0.1198 0.1037 0.1025 0.0903 0.0889 0.0895
va: 1.1403 1.2508 1.0957 1.0800 1.0790 2.1728 1.9987 2.0380 3.1895 3.2599 2.9268 3.5644 3.8726 3.7897 3.9995 3.8832 4.2864 3.9153 3.9908 4.0927 3.9713 4.1740 3.9244 4.2050 3.8389 3.9715 1.0209 1.0149 1.0305 1.0418 1.0100 0.9983 0.9990 1.0135 1.0026 0.9940 0.9947 1.0064 1.0037 1.0030
dispcorr: -0.020078941 hartree
energy: -2190.129039181802
dipole: -23.37415 22.99082 -0.38334 19.70914 -19.15314 0.55600 13.62444 -12.74105 0.88339
magnitude: 1.11196 au
magnitude: 2.82637 debye
