program: Orca
programVersion: 5.0.2
elementType: Cl Cl F F F O O O N N N C C C C C C C C C C C C C C C H H H H H H H H H H H H H H
charge: 0
multiplicity: 1
keywords: wb97x-d3
keywords: def2-TZVPP
keywords: def2/J RIJCOSX
keywords: DEFGRID2
keywords: scfconv7
keywords: smallprint printgap noloewdin
keywords: NOSOSCF
formula: C15H14Cl2F3N3O3
InChI: InChI=1/C15H14Cl2F3N3O3/c1-3-26-13(24)10(17)4-8-5-12(11(18)6-9(8)16)23-15(25)22(14(19)20)7(2)21-23/h5-6,10,14H,3-4H2,1-2H3
40 atoms
Cl -4.886414 1.255253 -1.672798
Cl -3.617104 -2.472436 0.83606
F  1.309544 -2.826748 1.645368
F  5.21926 1.819147 -0.013904
F  6.171952 -0.115341 0.14241
O  -2.932927 2.500527 0.680899
O  2.647275 -0.255235 1.909739
O  -1.788792 2.22485 -1.219709
N  1.963253 -0.901703 -0.219334
N  3.91529 -0.038493 -0.04586
N  2.463331 -0.817188 -1.488698
C  -1.725273 -1.083038 -0.523102
C  -2.811842 -0.475035 -1.367498
C  0.634015 -1.282781 0.009792
C  -0.397957 -0.728851 -0.731909
C  -3.521669 0.661623 -0.650234
C  2.812812 -0.391102 0.714676
C  -1.988295 -2.000915 0.493326
C  3.633316 -0.302076 -1.373627
C  0.326027 -2.228878 0.97432
C  -0.978625 -2.582292 1.241811
C  5.070379 0.578473 0.49718
C  4.544385 -0.037559 -2.505008
C  -2.636616 1.875262 -0.436107
C  -2.201374 3.705672 0.996796
C  -2.801081 4.29624 2.245028
H  -3.551783 -1.231749 -1.629536
H  -2.387005 -0.111246 -2.302484
H  -0.159393 -0.010992 -1.505243
H  -3.962699 0.335576 0.29008
H  -1.192894 -3.316162 2.007033
H  4.998344 0.63153 1.581462
H  4.046567 -0.312431 -3.431075
H  5.462148 -0.618649 -2.422974
H  4.814358 1.016356 -2.560814
H  -1.150282 3.452131 1.144317
H  -2.273242 4.403262 0.161175
H  -2.250173 5.200129 2.504223
H  -3.844666 4.574094 2.097873
H  -2.734785 3.612668 3.09123
elementType: Cl F O N C H
totalener: -2190.10928186 hartree
nucrepener: 2740.62678260 hartree
electener: -4930.73606445 hartree
oneelecener: -8463.49571006 hartree
twoeener: 3532.75964560 hartree
cpcmener: -0.03784448 hartree
kineticenergy: 2183.89675242 hartree
xcener: -156.792918146686 hartree
chargesum: -0.0000000
charge: -0.153461 -0.072697 -0.202378 -0.204690 -0.204351 -0.267136 -0.522811 -0.462942 0.045121 -0.154646 -0.313838 0.003951 -0.171376 0.010678 -0.119252 0.105674 0.414294 0.031496 0.219127 0.223321 -0.127146 0.401684 -0.247914 0.375071 0.040289 -0.248718 0.119824 0.117807 0.139625 0.130339 0.139128 0.129676 0.107000 0.121404 0.120543 0.106732 0.101035 0.090021 0.089296 0.090221
qa: -0.1535 -0.0727 -0.2024 -0.2047 -0.2044 -0.2671 -0.5228 -0.4629 0.0451 -0.1546 -0.3138 0.0040 -0.1714 0.0107 -0.1193 0.1057 0.4143 0.0315 0.2191 0.2233 -0.1271 0.4017 -0.2479 0.3751 0.0403 -0.2487 0.1198 0.1178 0.1396 0.1303 0.1391 0.1297 0.1070 0.1214 0.1205 0.1067 0.1010 0.0900 0.0893 0.0902
va: 1.1419 1.2525 1.0978 1.0800 1.0804 2.1730 2.0002 2.0335 3.1820 3.2621 2.9252 3.6645 3.8490 3.7727 3.9732 3.9120 4.2830 3.9209 3.9885 4.1017 3.9648 4.1732 3.9240 4.1742 3.8284 3.9721 1.0242 1.0282 1.0330 1.0422 1.0103 0.9983 1.0135 0.9995 1.0020 0.9938 0.9967 1.0066 1.0031 1.0030
dispcorr: -0.020538501 hartree
energy: -2190.129820357529
dipole: -4.16676 4.77886 0.61210 19.26103 -18.87416 0.38687 -1.33881 1.18430 -0.15450
magnitude: 0.74041 au
magnitude: 1.88197 debye
