program: Orca
programVersion: 5.0.2
elementType: Cl Cl F F F O O O N N N C C C C C C C C C C C C C C C H H H H H H H H H H H H H H
charge: 0
multiplicity: 1
keywords: wb97x-d3
keywords: def2-TZVPP
keywords: def2/J RIJCOSX
keywords: DEFGRID2
keywords: scfconv7
keywords: smallprint printgap noloewdin
keywords: NOSOSCF
formula: C15H14Cl2F3N3O3
InChI: InChI=1/C15H14Cl2F3N3O3/c1-3-26-13(24)10(17)4-8-5-12(11(18)6-9(8)16)23-15(25)22(14(19)20)7(2)21-23/h5-6,10,14H,3-4H2,1-2H3
40 atoms
Cl -4.848854 1.316074 -1.669857
Cl -3.621583 -2.465331 0.788723
F  1.297216 -2.83691 1.63584
F  5.188836 1.829978 -0.011548
F  6.183757 -0.081021 0.163235
O  -2.969784 2.557763 0.65961
O  2.641406 -0.260626 1.905999
O  -1.684772 2.197565 -1.134337
N  1.971852 -0.914347 -0.225469
N  3.925738 -0.056161 -0.040864
N  2.482236 -0.837667 -1.491075
C  -1.716039 -1.073295 -0.548175
C  -2.795413 -0.444025 -1.386616
C  0.639411 -1.290758 -0.004676
C  -0.385255 -0.728532 -0.74965
C  -3.494936 0.689576 -0.654459
C  2.814859 -0.401533 0.712861
C  -1.989482 -1.997379 0.459953
C  3.652984 -0.326235 -1.369628
C  0.320972 -2.237186 0.956014
C  -0.986922 -2.586975 1.211957
C  5.063007 0.588406 0.505884
C  4.578984 -0.076542 -2.492182
C  -2.600397 1.890904 -0.411742
C  -2.244794 3.760469 0.994893
C  -2.987057 4.452224 2.107437
H  -3.542832 -1.189636 -1.658996
H  -2.366162 -0.072197 -2.316367
H  -0.1370 -0.009793 -1.518715
H  -3.942994 0.352906 0.279067
H  -1.210004 -3.323038 1.972531
H  4.982009 0.646781 1.589193
H  4.849142 0.976742 -2.558221
H  4.095491 -0.364687 -3.421826
H  5.495684 -0.65581 -2.387921
H  -1.233868 3.487769 1.301899
H  -2.175149 4.402474 0.116131
H  -2.444176 5.355554 2.384024
H  -3.988379 4.748643 1.796578
H  -3.066135 3.826737 2.995856
elementType: Cl F O N C H
totalener: -2190.10914133 hartree
nucrepener: 2739.52253324 hartree
electener: -4929.63167457 hartree
oneelecener: -8461.38052279 hartree
twoeener: 3531.74884823 hartree
cpcmener: -0.03748362 hartree
kineticenergy: 2183.89945564 hartree
xcener: -156.793737974226 hartree
chargesum: -0.0000000
charge: -0.153182 -0.072475 -0.202484 -0.205328 -0.204543 -0.268987 -0.522296 -0.461584 0.044977 -0.155308 -0.313301 0.000296 -0.167484 0.009879 -0.117538 0.101479 0.413953 0.032670 0.218693 0.224211 -0.127987 0.401495 -0.247329 0.379311 0.040980 -0.248266 0.119660 0.117606 0.138596 0.131581 0.138971 0.129761 0.120497 0.106966 0.121097 0.108059 0.098573 0.090030 0.088615 0.090134
qa: -0.1532 -0.0725 -0.2025 -0.2053 -0.2045 -0.2690 -0.5223 -0.4616 0.0450 -0.1553 -0.3133 0.0003 -0.1675 0.0099 -0.1175 0.1015 0.4140 0.0327 0.2187 0.2242 -0.1280 0.4015 -0.2473 0.3793 0.0410 -0.2483 0.1197 0.1176 0.1386 0.1316 0.1390 0.1298 0.1205 0.1070 0.1211 0.1081 0.0986 0.0900 0.0886 0.0901
va: 1.1425 1.2529 1.0979 1.0790 1.0802 2.1719 2.0008 2.0333 3.1822 3.2609 2.9257 3.6644 3.8442 3.7713 3.9749 3.9126 4.2837 3.9208 3.9895 4.1034 3.9648 4.1735 3.9242 4.1730 3.8279 3.9714 1.0242 1.0273 1.0352 1.0413 1.0103 0.9984 1.0021 1.0135 0.9996 0.9933 0.9980 1.0067 1.0034 1.0029
dispcorr: -0.020527527 hartree
energy: -2190.129668853201
dipole: -4.65942 5.18194 0.52252 19.55045 -19.13932 0.41113 -1.64194 1.42106 -0.22088
magnitude: 0.70060 au
magnitude: 1.78079 debye
