program: Orca
programVersion: 5.0.2
elementType: Cl Cl F F F O O O N N N C C C C C C C C C C C C C C C H H H H H H H H H H H H H H
charge: 0
multiplicity: 1
keywords: wb97x-d3
keywords: def2-TZVPP
keywords: def2/J RIJCOSX
keywords: DEFGRID2
keywords: scfconv7
keywords: smallprint printgap noloewdin
keywords: NOSOSCF
formula: C15H14Cl2F3N3O3
InChI: InChI=1/C15H14Cl2F3N3O3/c1-3-26-13(24)10(17)4-8-5-12(11(18)6-9(8)16)23-15(25)22(14(19)20)7(2)21-23/h5-6,10,14H,3-4H2,1-2H3
40 atoms
Cl -4.065849 0.805279 3.226674
Cl -3.752866 -1.753631 -1.202908
F  1.049449 -1.561789 -2.562524
F  6.111439 -0.08246 -0.668516
F  5.502405 1.681132 0.420796
O  -2.215743 2.133092 0.273675
O  2.4870 0.807378 -1.823141
O  -4.346117 1.430759 0.274063
N  1.936659 -0.663273 -0.104321
N  3.926323 0.129262 -0.106548
N  2.549862 -1.15197 1.015112
C  -1.709709 -1.03552 0.447739
C  -2.671904 -0.841876 1.588342
C  0.580902 -0.919283 -0.350787
C  -0.359877 -0.769988 0.653497
C  -2.818414 0.635892 1.955511
C  2.739629 0.168954 -0.821761
C  -2.094059 -1.437898 -0.829543
C  3.742876 -0.678785 1.000746
C  0.155166 -1.35847 -1.59645
C  -1.173809 -1.605519 -1.85318
C  5.102056 0.802461 -0.522432
C  4.765106 -0.960708 2.028392
C  -3.238258 1.449623 0.745411
C  -2.361966 2.856726 -0.965747
C  -2.10396 1.964229 -2.155151
H  -2.303317 -1.371027 2.467848
H  -3.651929 -1.251677 1.351973
H  -0.034235 -0.442795 1.633282
H  -1.889021 1.022422 2.370464
H  -1.479569 -1.938612 -2.835901
H  4.926821 1.323526 -1.461455
H  5.628731 -1.472374 1.605529
H  4.330633 -1.599474 2.79306
H  5.112305 -0.044059 2.503592
H  -3.344941 3.324352 -1.01444
H  -1.616046 3.646769 -0.907095
H  -2.126136 2.570843 -3.060816
H  -1.12141 1.495259 -2.092816
H  -2.859964 1.186533 -2.259681
elementType: Cl F O N C H
totalener: -2190.10710418 hartree
nucrepener: 2807.35688430 hartree
electener: -4997.46398848 hartree
oneelecener: -8596.55665613 hartree
twoeener: 3599.09266765 hartree
cpcmener: -0.04323690 hartree
kineticenergy: 2183.90382566 hartree
xcener: -156.797478190044 hartree
chargesum: 0.0000000
charge: -0.153730 -0.071739 -0.203105 -0.205029 -0.204486 -0.266158 -0.527757 -0.447683 0.053931 -0.153280 -0.314657 -0.038939 -0.134224 0.003687 -0.127425 0.089558 0.416685 0.048894 0.220847 0.244258 -0.131865 0.400233 -0.248667 0.344917 0.040648 -0.250475 0.125784 0.109847 0.139540 0.139427 0.134626 0.129476 0.121488 0.107644 0.120762 0.098269 0.112968 0.110973 0.079976 0.084782
qa: -0.1537 -0.0717 -0.2031 -0.2050 -0.2045 -0.2662 -0.5278 -0.4477 0.0539 -0.1533 -0.3147 -0.0389 -0.1342 0.0037 -0.1274 0.0896 0.4167 0.0489 0.2208 0.2443 -0.1319 0.4002 -0.2487 0.3449 0.0406 -0.2505 0.1258 0.1098 0.1395 0.1394 0.1346 0.1295 0.1215 0.1076 0.1208 0.0983 0.1130 0.1110 0.0800 0.0848
va: 1.1452 1.2483 1.0966 1.0789 1.0800 2.1541 1.9899 2.0529 3.1881 3.2675 2.9257 3.7361 3.8572 3.7524 3.9987 3.9409 4.2709 3.8276 3.9856 4.0370 3.9554 4.1737 3.9247 4.2256 3.8321 3.9245 1.0179 1.0390 1.0207 1.0282 1.0141 0.9986 1.0000 1.0134 1.0009 1.0113 0.9952 1.0106 1.0094 1.0081
dispcorr: -0.023929777 hartree
energy: -2190.131033955804
dipole: -1.62086 4.03525 2.41439 7.36154 -7.51819 -0.15664 0.85754 -0.01147 0.84606
magnitude: 2.56313 au
magnitude: 6.51496 debye
