program: Orca
programVersion: 5.0.2
elementType: Cl Cl F F F O O O N N N C C C C C C C C C C C C C C C H H H H H H H H H H H H H H
charge: 0
multiplicity: 1
keywords: wb97x-d3
keywords: def2-TZVPP
keywords: def2/J RIJCOSX
keywords: DEFGRID2
keywords: scfconv7
keywords: smallprint printgap noloewdin
keywords: NOSOSCF
formula: C15H14Cl2F3N3O3
InChI: InChI=1/C15H14Cl2F3N3O3/c1-3-26-13(24)10(17)4-8-5-12(11(18)6-9(8)16)23-15(25)22(14(19)20)7(2)21-23/h5-6,10,14H,3-4H2,1-2H3
40 atoms
Cl -4.94032 1.63771 -1.358809
Cl -3.622176 -2.72582 0.296559
F  1.244095 -2.616295 1.46136
F  5.977997 0.344842 0.344639
F  5.605186 0.37961 -1.786694
O  -2.282097 1.456459 1.294983
O  3.126212 -2.236198 -0.658235
O  -2.24603 2.710996 -0.561555
N  1.782266 -0.414377 -0.113065
N  3.871535 -0.035177 -0.378701
N  1.954211 0.933272 0.036484
C  -1.842333 -0.924007 -0.668172
C  -2.958972 -0.216138 -1.382034
C  0.502884 -0.981128 -0.050799
C  -0.550451 -0.420667 -0.754816
C  -3.668349 0.772511 -0.450065
C  2.941737 -1.062669 -0.408505
C  -2.041918 -2.044099 0.135902
C  3.208831 1.150747 -0.122113
C  0.253104 -2.087083 0.746709
C  -1.005204 -2.641774 0.833504
C  5.250676 -0.230631 -0.634966
C  3.845426 2.480413 -0.025566
C  -2.669274 1.784219 0.080833
C  -1.203223 2.196505 1.905076
C  -1.672747 3.497219 2.510064
H  -3.696501 -0.920738 -1.765298
H  -2.555914 0.328599 -2.236185
H  -0.362956 0.44284 -1.380641
H  -4.159139 0.252419 0.371236
H  -1.170596 -3.507133 1.461167
H  5.480364 -1.292137 -0.695281
H  4.51892 2.537014 0.828779
H  3.072319 3.23395 0.099394
H  4.414368 2.71722 -0.923751
H  -0.825225 1.527774 2.675648
H  -0.406823 2.353204 1.176972
H  -0.834749 3.95895 3.032877
H  -2.023963 4.203499 1.759631
H  -2.467727 3.334077 3.237297
elementType: Cl F O N C H
totalener: -2190.10687085 hartree
nucrepener: 2800.54305535 hartree
electener: -4990.64992619 hartree
oneelecener: -8582.74885717 hartree
twoeener: 3592.09893098 hartree
cpcmener: -0.03962927 hartree
kineticenergy: 2183.92179205 hartree
xcener: -156.800183963691 hartree
chargesum: 0.0000000
charge: -0.153358 -0.070647 -0.202159 -0.204107 -0.205016 -0.273168 -0.521399 -0.452265 0.083562 -0.154393 -0.325700 -0.001890 -0.177847 -0.016837 -0.148192 0.085772 0.403932 0.047268 0.228978 0.247618 -0.134589 0.399697 -0.249058 0.378057 0.048434 -0.250973 0.118718 0.125656 0.146683 0.127927 0.139608 0.130098 0.121996 0.108602 0.119507 0.116137 0.084809 0.098288 0.087680 0.092572
qa: -0.1534 -0.0706 -0.2022 -0.2041 -0.2050 -0.2732 -0.5214 -0.4523 0.0836 -0.1544 -0.3257 -0.0019 -0.1778 -0.0168 -0.1482 0.0858 0.4039 0.0473 0.2290 0.2476 -0.1346 0.3997 -0.2491 0.3781 0.0484 -0.2510 0.1187 0.1257 0.1467 0.1279 0.1396 0.1301 0.1220 0.1086 0.1195 0.1161 0.0848 0.0983 0.0877 0.0926
va: 1.1465 1.2543 1.0986 1.0814 1.0780 2.1516 2.0015 2.0488 3.1408 3.2623 2.9073 3.6313 3.8745 3.7602 3.9390 3.9704 4.2847 3.9271 3.9654 4.0764 3.9784 4.1760 3.9302 4.1739 3.8004 3.9460 1.0242 1.0235 1.0237 1.0412 1.0105 0.9974 0.9985 1.0106 1.0032 0.9941 1.0215 1.0056 1.0135 1.0041
dispcorr: -0.023127517 hartree
energy: -2190.129998363420
dipole: -1.39899 2.36523 0.96625 21.27072 -20.63552 0.63520 8.84156 -7.60386 1.23770
magnitude: 1.69382 au
magnitude: 4.30534 debye
