program: Orca
programVersion: 5.0.2
elementType: Cl Cl F F F O O O N N N C C C C C C C C C C C C C C C H H H H H H H H H H H H H H
charge: 0
multiplicity: 1
keywords: wb97x-d3
keywords: def2-TZVPP
keywords: def2/J RIJCOSX
keywords: DEFGRID2
keywords: scfconv7
keywords: smallprint printgap noloewdin
keywords: NOSOSCF
formula: C15H14Cl2F3N3O3
InChI: InChI=1/C15H14Cl2F3N3O3/c1-3-26-13(24)10(17)4-8-5-12(11(18)6-9(8)16)23-15(25)22(14(19)20)7(2)21-23/h5-6,10,14H,3-4H2,1-2H3
40 atoms
Cl -4.893907 1.804645 -0.834142
Cl -3.631697 -2.836991 -0.089899
F  1.224966 -2.920933 1.116826
F  5.881834 0.121047 0.64329
F  5.723137 0.681664 -1.437337
O  -2.13685 2.402297 0.126987
O  3.170605 -2.211238 -0.865696
O  -2.521655 1.069966 1.885594
N  1.778201 -0.495275 -0.126738
N  3.857224 -0.031615 -0.358409
N  1.917805 0.831914 0.170266
C  -1.847456 -0.901574 -0.732162
C  -2.964492 -0.063293 -1.286846
C  0.502718 -1.074892 -0.147476
C  -0.551577 -0.403266 -0.747058
C  -3.6959 0.658172 -0.153152
C  2.954497 -1.077649 -0.491301
C  -2.05132 -2.138429 -0.123931
C  3.165393 1.097801 0.038127
C  0.244852 -2.285289 0.476899
C  -1.017359 -2.839971 0.472574
C  5.255865 -0.185246 -0.51377
C  3.766026 2.426928 0.268292
C  -2.731794 1.407252 0.746821
C  -1.109052 3.136785 0.824348
C  -1.683163 4.214077 1.712627
H  -3.686242 -0.665938 -1.838311
H  -2.556161 0.670232 -1.981547
H  -0.358563 0.545391 -1.231235
H  -4.252434 -0.04521 0.463116
H  -1.188265 -3.791398 0.958317
H  5.497333 -1.204625 -0.806936
H  4.260998 2.798674 -0.627888
H  4.497518 2.400707 1.075016
H  2.980783 3.127059 0.541324
H  -0.479299 2.447544 1.38668
H  -0.505125 3.570441 0.030027
H  -2.323079 4.895357 1.152349
H  -2.253059 3.803885 2.5454
H  -0.860776 4.797053 2.128367
elementType: Cl F O N C H
totalener: -2190.10645814 hartree
nucrepener: 2795.61614982 hartree
electener: -4985.72260796 hartree
oneelecener: -8573.08826256 hartree
twoeener: 3587.36565460 hartree
cpcmener: -0.04001605 hartree
kineticenergy: 2183.91427773 hartree
xcener: -156.798399406134 hartree
chargesum: -0.0000000
charge: -0.156165 -0.070326 -0.201472 -0.205534 -0.204826 -0.274711 -0.519197 -0.451263 0.066410 -0.154079 -0.322379 -0.018537 -0.176709 0.008779 -0.134034 0.072377 0.405235 0.048772 0.230605 0.243886 -0.137849 0.401216 -0.252872 0.392318 0.040267 -0.249425 0.124894 0.117231 0.146038 0.130936 0.139374 0.129061 0.121350 0.122474 0.107678 0.087191 0.113766 0.090686 0.089349 0.099483
qa: -0.1562 -0.0703 -0.2015 -0.2055 -0.2048 -0.2747 -0.5192 -0.4513 0.0664 -0.1541 -0.3224 -0.0185 -0.1767 0.0088 -0.1340 0.0724 0.4052 0.0488 0.2306 0.2439 -0.1378 0.4012 -0.2529 0.3923 0.0403 -0.2494 0.1249 0.1172 0.1460 0.1309 0.1394 0.1291 0.1213 0.1225 0.1077 0.0872 0.1138 0.0907 0.0893 0.0995
va: 1.1442 1.2547 1.0979 1.0783 1.0800 2.1572 2.0032 2.0397 3.1564 3.2654 2.9069 3.6633 3.8822 3.7808 3.9436 3.9541 4.2840 3.9248 3.9623 4.0771 3.9790 4.1748 3.9337 4.1561 3.8148 3.9443 1.0203 1.0248 1.0174 1.0376 1.0104 0.9986 1.0008 1.0008 1.0102 1.0171 0.9952 1.0045 1.0121 1.0060
dispcorr: -0.023073914 hartree
energy: -2190.129532054505
dipole: -1.59526 2.66792 1.07266 25.37135 -23.46329 1.90806 4.60527 -5.24583 -0.64057
magnitude: 2.28070 au
magnitude: 5.79709 debye
