program: Orca
programVersion: 5.0.2
elementType: Cl Cl F F F O O O N N N C C C C C C C C C C C C C C C H H H H H H H H H H H H H H
charge: 0
multiplicity: 1
keywords: wb97x-d3
keywords: def2-TZVPP
keywords: def2/J RIJCOSX
keywords: DEFGRID2
keywords: scfconv7
keywords: smallprint printgap noloewdin
keywords: NOSOSCF
formula: C15H14Cl2F3N3O3
InChI: InChI=1/C15H14Cl2F3N3O3/c1-3-26-13(24)10(17)4-8-5-12(11(18)6-9(8)16)23-15(25)22(14(19)20)7(2)21-23/h5-6,10,14H,3-4H2,1-2H3
40 atoms
Cl -2.192237 2.127166 -1.883407
Cl -3.632343 -1.806713 1.141536
F  1.225057 -1.360785 2.235227
F  6.130156 0.099107 0.122994
F  5.855901 -0.621777 -1.895258
O  -3.183732 1.476663 0.76959
O  3.073135 -2.301194 0.231242
O  -5.261722 1.168791 0.003323
N  1.90675 -0.342896 -0.236645
N  4.018046 -0.324393 -0.595336
N  2.199884 0.88544 -0.760081
C  -1.75718 -0.810662 -0.551424
C  -2.827879 -0.52439 -1.563419
C  0.586403 -0.697846 0.073668
C  -0.433236 -0.506598 -0.845863
C  -3.426856 0.884016 -1.498024
C  2.999614 -1.147181 -0.138257
C  -2.018064 -1.368434 0.699084
C  3.466487 0.88842 -0.966994
C  0.268603 -1.21745 1.318681
C  -1.021317 -1.581006 1.636164
C  5.376588 -0.724606 -0.637214
C  4.220662 2.028679 -1.524334
C  -4.066596 1.202751 -0.161252
C  -3.64416 1.709773 2.115931
C  -2.427192 1.819048 2.996967
H  -3.657022 -1.228169 -1.474233
H  -2.425694 -0.656425 -2.568082
H  -0.188098 -0.106926 -1.820803
H  -4.195647 0.964944 -2.26388
H  -1.240605 -1.995796 2.610801
H  5.479537 -1.74882 -0.285266
H  3.528065 2.834203 -1.753974
H  4.739507 1.751913 -2.441152
H  4.959036 2.402737 -0.815666
H  -4.233616 2.628006 2.138221
H  -4.284038 0.885046 2.43319
H  -2.748303 1.992804 4.023577
H  -1.837463 0.90205 2.983264
H  -1.786955 2.650747 2.702796
elementType: Cl F O N C H
totalener: -2190.10630184 hartree
nucrepener: 2827.87203533 hartree
electener: -5017.97833718 hartree
oneelecener: -8638.18081665 hartree
twoeener: 3620.20247948 hartree
cpcmener: -0.04209609 hartree
kineticenergy: 2183.91840585 hartree
xcener: -156.801337896865 hartree
chargesum: -0.0000000
charge: -0.160130 -0.074467 -0.203635 -0.204841 -0.205035 -0.256755 -0.522799 -0.451065 0.048256 -0.153697 -0.307917 0.062972 -0.187164 0.006508 -0.159783 0.137256 0.411047 0.022645 0.217249 0.241950 -0.136587 0.398785 -0.249744 0.311149 0.004479 -0.248381 0.134394 0.123379 0.136247 0.139418 0.140333 0.129780 0.107084 0.120376 0.121335 0.122996 0.104470 0.096038 0.091370 0.092483
qa: -0.1601 -0.0745 -0.2036 -0.2048 -0.2050 -0.2568 -0.5228 -0.4511 0.0483 -0.1537 -0.3079 0.0630 -0.1872 0.0065 -0.1598 0.1373 0.4110 0.0226 0.2172 0.2420 -0.1366 0.3988 -0.2497 0.3111 0.0045 -0.2484 0.1344 0.1234 0.1362 0.1394 0.1403 0.1298 0.1071 0.1204 0.1213 0.1230 0.1045 0.0960 0.0914 0.0925
va: 1.1448 1.2537 1.0954 1.0786 1.0799 2.1374 2.0008 2.0451 3.1852 3.2588 2.9270 3.5332 3.8751 3.7732 4.0541 3.9474 4.2868 3.8692 3.9951 4.0677 3.9222 4.1744 3.9245 4.2642 3.8197 3.9580 1.0168 1.0127 1.0337 1.0218 1.0109 0.9987 1.0136 1.0014 1.0000 0.9980 1.0041 1.0090 0.9970 1.0036
dispcorr: -0.023747579 hartree
energy: -2190.130049421589
dipole: -12.00871 12.72071 0.71201 11.99491 -11.23423 0.76068 3.99207 -4.45697 -0.46490
magnitude: 1.14093 au
magnitude: 2.90002 debye
