program: Orca
programVersion: 5.0.2
elementType: Cl Cl F F F O O O N N N C C C C C C C C C C C C C C C H H H H H H H H H H H H H H
charge: 0
multiplicity: 1
keywords: wb97x-d3
keywords: def2-TZVPP
keywords: def2/J RIJCOSX
keywords: DEFGRID2
keywords: scfconv7
keywords: smallprint printgap noloewdin
keywords: NOSOSCF
formula: C15H14Cl2F3N3O3
InChI: InChI=1/C15H14Cl2F3N3O3/c1-3-26-13(24)10(17)4-8-5-12(11(18)6-9(8)16)23-15(25)22(14(19)20)7(2)21-23/h5-6,10,14H,3-4H2,1-2H3
40 atoms
Cl -4.986306 1.767481 -0.944992
Cl -3.570923 -2.805059 -0.214978
F  1.244837 -2.881569 1.147903
F  6.024648 0.046624 0.432566
F  5.641411 0.717784 -1.586208
O  -2.255505 2.252472 0.424935
O  3.095616 -2.128366 -0.954433
O  -3.283558 1.155709 2.078475
N  1.818443 -0.431577 -0.000987
N  3.894286 -0.016745 -0.334818
N  2.021262 0.865936 0.375531
C  -1.808964 -0.791247 -0.657936
C  -2.912583 0.034252 -1.261204
C  0.528814 -0.977871 -0.027869
C  -0.519136 -0.277297 -0.604534
C  -3.829484 0.614592 -0.188538
C  2.947713 -1.021367 -0.48785
C  -2.010273 -2.065924 -0.129808
C  3.266576 1.102795 0.179433
C  0.269085 -2.22069 0.528283
C  -0.986513 -2.785433 0.463806
C  5.261606 -0.186352 -0.657702
C  3.931938 2.391782 0.461664
C  -3.098091 1.365146 0.907683
C  -1.476204 3.023249 1.359904
C  -0.497162 3.853716 0.57253
H  -3.518214 -0.562056 -1.945475
H  -2.475883 0.843214 -1.845896
H  -0.319332 0.694035 -1.038138
H  -4.432275 -0.159578 0.281309
H  -1.158712 -3.765849 0.887956
H  5.440573 -1.194517 -1.027957
H  4.728869 2.279442 1.195994
H  3.198719 3.089753 0.858356
H  4.361937 2.824058 -0.4413
H  -2.146637 3.653826 1.947686
H  -0.953659 2.349677 2.042012
H  0.211303 3.228926 0.027616
H  -0.999565 4.515092 -0.133951
H  0.072609 4.475906 1.263167
elementType: Cl F O N C H
totalener: -2190.11820465 hartree
nucrepener: 2790.46407292 hartree
electener: -4980.58227756 hartree
oneelecener: -8562.40877824 hartree
twoeener: 3581.82650068 hartree
cpcmener: -0.03295751 hartree
kineticenergy: 2183.90587212 hartree
xcener: -156.793536805644 hartree
chargesum: -0.0000000
charge: -0.152624 -0.069684 -0.199287 -0.204382 -0.204175 -0.267062 -0.487208 -0.426242 0.053018 -0.155268 -0.320011 -0.012375 -0.163550 0.021572 -0.143869 0.062632 0.389991 0.039074 0.227718 0.231612 -0.126835 0.399949 -0.257818 0.374527 0.022382 -0.250169 0.126247 0.111089 0.146334 0.134339 0.137829 0.127333 0.124547 0.107270 0.120373 0.117740 0.102219 0.073300 0.095798 0.093666
qa: -0.1526 -0.0697 -0.1993 -0.2044 -0.2042 -0.2671 -0.4872 -0.4262 0.0530 -0.1553 -0.3200 -0.0124 -0.1636 0.0216 -0.1439 0.0626 0.3900 0.0391 0.2277 0.2316 -0.1268 0.3999 -0.2578 0.3745 0.0224 -0.2502 0.1262 0.1111 0.1463 0.1343 0.1378 0.1273 0.1245 0.1073 0.1204 0.1177 0.1022 0.0733 0.0958 0.0937
va: 1.1459 1.2559 1.1023 1.0797 1.0803 2.1492 2.0463 2.0781 3.1570 3.2589 2.9055 3.6468 3.8636 3.7610 3.9767 3.9446 4.3055 3.9286 3.9611 4.0917 3.9644 4.1741 3.9355 4.1542 3.8158 3.9689 1.0158 1.0288 1.0096 1.0373 1.0106 1.0000 1.0014 1.0091 1.0009 0.9973 1.0018 1.0076 1.0057 1.0071
dispcorr: -0.023072049 hartree
energy: -2190.141276694905
dipole: 1.37832 0.03219 1.41051 24.33608 -22.70028 1.63580 3.68451 -4.17011 -0.48560
magnitude: 2.21386 au
magnitude: 5.62719 debye
