program: Orca
programVersion: 5.0.2
elementType: Cl Cl F F F O O O N N N C C C C C C C C C C C C C C C H H H H H H H H H H H H H H
charge: 0
multiplicity: 1
keywords: wb97x-d3
keywords: def2-TZVPP
keywords: def2/J RIJCOSX
keywords: DEFGRID2
keywords: scfconv7
keywords: smallprint printgap noloewdin
keywords: NOSOSCF
formula: C15H14Cl2F3N3O3
InChI: InChI=1/C15H14Cl2F3N3O3/c1-3-26-13(24)10(17)4-8-5-12(11(18)6-9(8)16)23-15(25)22(14(19)20)7(2)21-23/h5-6,10,14H,3-4H2,1-2H3
40 atoms
Cl -4.81154 2.063608 -1.017365
Cl -3.742992 -2.565355 -0.242098
F  1.110913 -3.055176 0.877748
F  5.904903 0.055979 -1.224037
F  5.155488 2.00293 -0.651477
O  -2.621509 1.155645 1.803717
O  2.182248 0.141634 -2.307606
O  -2.09184 2.667362 0.236554
N  1.810923 -0.587407 -0.126498
N  3.741311 0.231068 -0.565384
N  2.532009 -0.649077 1.03259
C  -1.834141 -0.720462 -0.795474
C  -2.887428 0.181568 -1.376132
C  0.491012 -1.05148 -0.180208
C  -0.514922 -0.285425 -0.748326
C  -3.656359 0.913623 -0.276317
C  2.518672 -0.047693 -1.159184
C  -2.122764 -1.960864 -0.230865
C  3.685204 -0.1595 0.76062
C  0.158265 -2.289069 0.351045
C  -1.140033 -2.750052 0.343496
C  4.810567 0.846416 -1.258829
C  4.79212 -0.036566 1.73252
C  -2.702979 1.699984 0.607315
C  -1.693956 1.708171 2.759579
C  -0.285585 1.209096 2.53732
H  -3.597802 -0.380471 -1.983428
H  -2.413326 0.915413 -2.028304
H  -0.273395 0.688165 -1.154435
H  -4.244311 0.218867 0.320603
H  -1.369476 -3.717871 0.769713
H  4.527507 1.042165 -2.291782
H  5.681005 -0.567999 1.394503
H  4.477669 -0.467176 2.680168
H  5.064146 1.004692 1.902721
H  -1.743702 2.797591 2.740168
H  -2.072735 1.373126 3.723578
H  0.139317 1.566551 1.600247
H  0.346684 1.576706 3.346814
H  -0.242624 0.119895 2.552555
elementType: Cl F O N C H
totalener: -2190.11735537 hartree
nucrepener: 2820.41524250 hartree
electener: -5010.53259788 hartree
oneelecener: -8622.51713124 hartree
twoeener: 3611.98453337 hartree
cpcmener: -0.03267550 hartree
kineticenergy: 2183.91057247 hartree
xcener: -156.796925381211 hartree
chargesum: 0.0000000
charge: -0.151571 -0.070222 -0.198943 -0.204029 -0.204400 -0.261380 -0.491506 -0.426100 0.094174 -0.158815 -0.299862 -0.034686 -0.185456 -0.102732 -0.086980 0.076261 0.394273 0.065180 0.216993 0.282855 -0.153317 0.397796 -0.252523 0.349686 0.042925 -0.256827 0.123391 0.119777 0.147890 0.125949 0.135645 0.127510 0.119647 0.107617 0.120445 0.098014 0.111196 0.090978 0.107951 0.083194
qa: -0.1516 -0.0702 -0.1989 -0.2040 -0.2044 -0.2614 -0.4915 -0.4261 0.0942 -0.1588 -0.2999 -0.0347 -0.1855 -0.1027 -0.0870 0.0763 0.3943 0.0652 0.2170 0.2829 -0.1533 0.3978 -0.2525 0.3497 0.0429 -0.2568 0.1234 0.1198 0.1479 0.1259 0.1356 0.1275 0.1196 0.1076 0.1204 0.0980 0.1112 0.0910 0.1080 0.0832
va: 1.1462 1.2557 1.1001 1.0807 1.0792 2.1572 2.0387 2.0789 3.1817 3.2535 2.9095 3.6824 3.8872 3.7719 3.8613 3.9671 4.2845 3.8948 3.9769 4.0525 4.0050 4.1773 3.9267 4.2099 3.8482 3.9172 1.0198 1.0247 1.0236 1.0449 1.0125 1.0000 1.0016 1.0133 1.0000 1.0090 0.9953 1.0078 1.0085 1.0045
dispcorr: -0.024401384 hartree
energy: -2190.141756756481
dipole: 4.21867 -3.03670 1.18197 7.70205 -8.47567 -0.77362 15.58312 -13.81680 1.76632
magnitude: 2.26173 au
magnitude: 5.74886 debye
