program: Orca
programVersion: 5.0.2
elementType: Cl Cl F F F O O O N N N C C C C C C C C C C C C C C C H H H H H H H H H H H H H H
charge: 0
multiplicity: 1
keywords: wb97x-d3
keywords: def2-TZVPP
keywords: def2/J RIJCOSX
keywords: DEFGRID2
keywords: scfconv7
keywords: smallprint printgap noloewdin
keywords: NOSOSCF
formula: C15H14Cl2F3N3O3
InChI: InChI=1/C15H14Cl2F3N3O3/c1-3-26-13(24)10(17)4-8-5-12(11(18)6-9(8)16)23-15(25)22(14(19)20)7(2)21-23/h5-6,10,14H,3-4H2,1-2H3
40 atoms
Cl -4.906806 1.551111 -1.262515
Cl -3.605642 -2.790802 0.382964
F  1.313976 -2.97739 1.270878
F  5.298279 1.772388 0.424873
F  6.107193 -0.201068 0.068574
O  -2.121529 2.328663 -0.369188
O  2.680409 -0.573419 1.952878
O  -2.769699 1.569915 1.635771
N  1.878177 -0.717207 -0.230285
N  3.856999 0.062609 0.033475
N  2.323674 -0.355927 -1.470264
C  -1.795124 -1.021941 -0.59038
C  -2.906215 -0.294535 -1.298138
C  0.570109 -1.189686 -0.061617
C  -0.489908 -0.556807 -0.694582
C  -3.699514 0.590966 -0.339571
C  2.781054 -0.440344 0.754336
C  -2.011175 -2.146993 0.204613
C  3.508759 0.104802 -1.30371
C  0.30818 -2.31952 0.698053
C  -0.975126 -2.798644 0.85173
C  5.073964 0.457388 0.63775
C  4.372935 0.609359 -2.391624
C  -2.81974 1.554165 0.433494
C  -1.215497 3.288516 0.206854
C  -1.928416 4.542553 0.655322
H  -3.594954 -0.999229 -1.766509
H  -2.485701 0.315991 -2.096866
H  -0.285645 0.313511 -1.30508
H  -4.260555 -0.004628 0.378203
H  -1.15102 -3.683172 1.449525
H  5.049332 0.25522 1.70716
H  3.830549 0.545808 -3.33184
H  5.286107 0.022332 -2.482906
H  4.654048 1.649377 -2.227921
H  -0.655692 2.82853 1.022563
H  -0.514757 3.510618 -0.596058
H  -2.482685 4.999079 -0.165206
H  -2.614785 4.35806 1.480836
H  -1.186047 5.264979 0.997438
elementType: Cl F O N C H
totalener: -2190.11724709 hartree
nucrepener: 2775.32183768 hartree
electener: -4965.43908477 hartree
oneelecener: -8532.40538071 hartree
twoeener: 3566.96629594 hartree
cpcmener: -0.03350483 hartree
kineticenergy: 2183.90228655 hartree
xcener: -156.793411770631 hartree
chargesum: -0.0000000
charge: -0.153607 -0.070088 -0.199116 -0.204783 -0.204272 -0.272171 -0.485701 -0.425288 0.049112 -0.158509 -0.309824 -0.026330 -0.185450 0.007485 -0.110076 0.074065 0.389786 0.051715 0.217136 0.248019 -0.143994 0.398716 -0.251530 0.374844 0.032320 -0.247554 0.125441 0.116153 0.138607 0.129040 0.137210 0.128016 0.106766 0.120941 0.119815 0.095971 0.109961 0.089102 0.091201 0.096871
qa: -0.1536 -0.0701 -0.1991 -0.2048 -0.2043 -0.2722 -0.4857 -0.4253 0.0491 -0.1585 -0.3098 -0.0263 -0.1854 0.0075 -0.1101 0.0741 0.3898 0.0517 0.2171 0.2480 -0.1440 0.3987 -0.2515 0.3748 0.0323 -0.2476 0.1254 0.1162 0.1386 0.1290 0.1372 0.1280 0.1068 0.1209 0.1198 0.0960 0.1100 0.0891 0.0912 0.0969
va: 1.1463 1.2556 1.1017 1.0790 1.0801 2.1492 2.0455 2.0748 3.1758 3.2558 2.9252 3.6744 3.8732 3.7833 3.9237 3.9399 4.3089 3.9205 3.9896 4.0888 3.9909 4.1740 3.9236 4.1732 3.8341 3.9329 1.0181 1.0264 1.0246 1.0393 1.0113 0.9994 1.0134 1.0004 1.0014 1.0093 0.9951 1.0043 1.0130 1.0069
dispcorr: -0.021973226 hartree
energy: -2190.139220316730
dipole: -0.77592 2.18270 1.40678 21.33012 -20.60628 0.72385 -6.86028 4.90366 -1.95662
magnitude: 2.51622 au
magnitude: 6.39572 debye
