program: Orca
programVersion: 5.0.2
elementType: Cl Cl F F F O O O N N N C C C C C C C C C C C C C C C H H H H H H H H H H H H H H
charge: 0
multiplicity: 1
keywords: wb97x-d3
keywords: def2-TZVPP
keywords: def2/J RIJCOSX
keywords: DEFGRID2
keywords: scfconv7
keywords: smallprint printgap noloewdin
keywords: NOSOSCF
formula: C15H14Cl2F3N3O3
InChI: InChI=1/C15H14Cl2F3N3O3/c1-3-26-13(24)10(17)4-8-5-12(11(18)6-9(8)16)23-15(25)22(14(19)20)7(2)21-23/h5-6,10,14H,3-4H2,1-2H3
40 atoms
Cl -4.793942 1.570421 -1.243417
Cl -3.626329 -2.651645 0.558413
F  1.286267 -2.993424 1.435177
F  5.408967 1.425908 -1.232607
F  5.501226 1.126007 0.90869
O  -2.320689 2.054312 1.217208
O  1.755118 1.386426 0.197015
O  -1.786879 2.425754 -0.925826
N  1.942326 -0.895252 -0.233517
N  3.751867 0.249037 -0.235148
N  2.95591 -1.773746 -0.489774
C  -1.743792 -1.064255 -0.579309
C  -2.833098 -0.313744 -1.29443
C  0.618634 -1.325884 -0.081502
C  -0.415201 -0.69143 -0.752358
C  -3.430338 0.761347 -0.395485
C  2.383918 0.382042 -0.055735
C  -2.00166 -2.125937 0.285723
C  4.034826 -1.081346 -0.488427
C  0.311245 -2.377625 0.770039
C  -0.987814 -2.797981 0.949133
C  4.650555 1.334245 -0.119757
C  5.384542 -1.633042 -0.729226
C  -2.41609 1.848078 -0.077947
C  -1.395713 3.054496 1.691278
C  -1.957925 4.450836 1.573656
H  -3.62772 -0.990284 -1.608729
H  -2.431902 0.149133 -2.196255
H  -0.180985 0.109605 -1.441128
H  -3.842542 0.334601 0.517337
H  -1.200162 -3.623517 1.615604
H  4.106258 2.263809 0.035677
H  6.041964 -1.466235 0.123537
H  5.850575 -1.187958 -1.607607
H  5.301716 -2.704727 -0.892761
H  -1.232154 2.792454 2.734858
H  -0.444626 2.956002 1.167978
H  -1.253152 5.150988 2.02418
H  -2.106676 4.754186 0.538301
H  -2.904602 4.54571 2.105559
elementType: Cl F O N C H
totalener: -2190.11807824 hartree
nucrepener: 2779.90345287 hartree
electener: -4970.02153111 hartree
oneelecener: -8542.27649186 hartree
twoeener: 3572.25496075 hartree
cpcmener: -0.03121379 hartree
kineticenergy: 2183.92173064 hartree
xcener: -156.796510896309 hartree
chargesum: -0.0000000
charge: -0.151325 -0.071002 -0.198036 -0.203815 -0.204674 -0.267336 -0.505217 -0.431818 0.033285 -0.155364 -0.299081 0.039581 -0.176051 0.048922 -0.190604 0.101274 0.411541 0.025930 0.211849 0.241891 -0.144882 0.397742 -0.250811 0.345899 0.048486 -0.256261 0.115639 0.120837 0.151108 0.122844 0.135910 0.127518 0.119700 0.119825 0.107370 0.111160 0.088772 0.097233 0.090709 0.091255
qa: -0.1513 -0.0710 -0.1980 -0.2038 -0.2047 -0.2673 -0.5052 -0.4318 0.0333 -0.1554 -0.2991 0.0396 -0.1761 0.0489 -0.1906 0.1013 0.4115 0.0259 0.2118 0.2419 -0.1449 0.3977 -0.2508 0.3459 0.0485 -0.2563 0.1156 0.1208 0.1511 0.1228 0.1359 0.1275 0.1197 0.1198 0.1074 0.1112 0.0888 0.0972 0.0907 0.0913
va: 1.1440 1.2537 1.1005 1.0808 1.0788 2.1561 2.0075 2.0683 3.2065 3.2563 2.9247 3.6278 3.8742 3.7417 3.9743 3.9340 4.2531 3.9184 3.9942 4.1083 3.9815 4.1764 3.9242 4.2037 3.8383 3.9261 1.0274 1.0280 1.0183 1.0447 1.0120 0.9999 1.0011 1.0003 1.0134 0.9955 1.0159 1.0063 1.0127 1.0044
dispcorr: -0.022023854 hartree
energy: -2190.140102094097
dipole: 1.56362 -0.19759 1.36602 14.06888 -14.77545 -0.70657 2.76475 -2.05814 0.70660
magnitude: 1.69250 au
magnitude: 4.30199 debye
