program: Gaussian 09
title: 000056480
version: EM64L-G09RevD.01
frameworkgroup: C1[X(C15H23NO2)]
method: RPBEPBE
basis: SDD
operation: Freq
keyword: #p
keyword: freq=noraman
keyword: PBEPBE/SDD
title: #p freq=noraman PBEPBE/SDD
converged: YES YES NO NO
title: Mulliken charges:
elementType: O O N C C C C C C C C C C C C C C C H H H H H H H H H H H H H H H H H H H H H H H
charge: -0.296181 -0.257991 -0.108472 -0.384062 -0.325490 -0.327788 -0.261230 -0.670097 -0.669117 0.080429 0.358208 0.170227 -0.531902 0.474089 -0.407767 -0.355773 -0.782466 -0.812062 0.210311 0.217867 0.206011 0.188359 0.208210 0.191298 0.240270 0.226199 0.209070 0.229104 0.206970 0.207351 0.229681 0.207012 0.276168 0.232105 0.231821 0.245687 0.247964 0.207811 0.228191 0.229583 0.230406
chargesum: 0.00000
title: Mulliken charges with hydrogens summed into heavy atoms:
elementType: O O N C C C C C C C C C C C C C C C
charge: -0.296181 -0.257991 -0.108472 0.044115 0.068879 0.071720 0.205238 -0.024954 -0.025072 0.080429 0.358208 0.170227 -0.255735 0.474089 -0.175662 -0.123951 -0.081004 -0.123883
polarizability: 2.35740069e+02 -6.83621283e+00 1.93479890e+02 3.34549784e+00 -7.31201043e+00 1.20479699e+02
1716.lowfreq: -0.0006 -0.0004 -0.0003 3.6534 5.6985 10.5604 15.5647 25.5734 38.1778
frequency: 15.0484 25.5423 38.1155 39.6495 42.4999 70.1962 76.5548 90.4012 112.0085 131.8243 154.6291 180.9088 183.6677 195.4377 214.4140 222.9024 278.9300 292.6092 297.1718 314.8780 324.0387 370.8128 384.8053 416.4195 436.9691 448.0424 463.4412 477.4066 519.6112 527.9607 671.4110 688.2694 729.7398 748.8848 759.0178 771.8180 788.9670 795.9347 803.0734 830.6585 885.1962 913.5582 924.3929 933.0953 971.7284 988.9547 995.8639 1012.3987 1036.5511 1044.1723 1052.3598 1061.4215 1063.5808 1076.1849 1085.4612 1095.1067 1123.3316 1154.9545 1166.2909 1184.2493 1208.3473 1218.8817 1230.9430 1254.6398 1276.1275 1283.1260 1286.9432 1290.3077 1326.6494 1362.0913 1365.7314 1370.2278 1386.8435 1386.9722 1388.3985 1394.8847 1399.3022 1405.0470 1454.4374 1460.2781 1461.2354 1463.0412 1471.0077 1471.6786 1471.7841 1478.8875 1480.1031 1485.6077 1487.4307 1491.5488 1495.6956 1573.2430 1603.8643 1627.9501 2853.0536 2862.0206 2902.7861 2976.9350 2982.1428 2983.4357 2989.9861 3017.1036 3023.6982 3034.2632 3052.8970 3054.3226 3073.9006 3075.8577 3076.2022 3086.5758 3088.6895 3089.9928 3092.1418 3092.9179 3115.3132 3140.4861 3166.0491
redmass: 3.2837 4.0183 1.2248 4.4296 2.7561 2.8707 3.0576 2.0965 3.0297 2.7637 2.0767 2.4567 1.0377 2.4060 2.3048 1.3812 2.0009 2.9387 2.2879 3.2302 3.1108 3.9619 4.4000 3.3349 3.2440 2.8244 4.7629 2.6705 3.2183 3.9497 6.9799 4.2469 4.0454 3.5085 3.8683 3.3142 1.1832 1.1434 1.3548 1.3172 5.8041 1.9694 1.3663 3.8936 1.3589 2.0898 1.8199 1.3814 4.4029 1.5762 1.5539 1.8387 2.4021 1.8755 2.2001 2.8788 1.7193 1.5421 1.4124 2.6775 2.2501 1.9502 1.6576 3.9735 1.1110 1.3438 1.2715 1.2506 1.3818 1.3419 1.4080 3.6866 1.4734 1.2666 1.2976 3.0482 1.2285 1.2408 1.0460 1.1048 1.0657 1.0520 1.0562 1.0674 1.0458 1.1205 1.0539 1.0730 1.0721 1.0762 3.1018 6.1824 8.8879 7.0324 1.0721 1.0714 1.0707 1.0374 1.0357 1.0358 1.0363 1.0582 1.0869 1.0874 1.0894 1.0976 1.0986 1.0981 1.0959 1.0986 1.1012 1.1076 1.1003 1.1004 1.0873 1.0965 1.0915
irintensity: 0.0370 0.3385 0.0457 0.9551 0.5340 0.2486 0.2930 0.1386 0.0896 3.4574 0.7841 1.4443 0.4622 0.4764 1.3135 0.3180 1.7465 6.6244 1.5971 0.1908 9.4264 2.1544 0.5282 13.1622 0.7756 10.0997 1.1087 4.2798 20.6976 4.1550 4.3242 1.1583 10.3769 4.4525 11.5516 1.9900 4.9633 3.4505 6.0566 24.6171 3.5403 0.6814 3.3764 36.9216 0.3271 15.0696 48.0670 5.3618 283.6498 5.3399 17.6872 37.3299 66.8164 18.5950 2.7881 3.7112 7.4727 49.4088 6.2971 228.8591 31.4794 20.8567 17.6334 160.4599 1.2942 7.8636 3.1015 24.1811 9.6521 1.9244 5.0641 18.7783 13.3190 22.0449 12.0273 3.0777 7.2123 21.1978 11.9833 9.1992 2.9170 6.9738 0.9563 2.9923 12.8813 20.0545 5.5106 12.5587 13.7698 9.9123 33.3636 42.3177 156.1315 30.6091 36.4290 156.5545 88.1648 37.3953 32.9071 30.2634 23.2253 23.6944 14.5492 17.9481 11.5799 21.2824 37.3193 80.5278 10.4694 16.1007 31.9191 43.1810 31.1862 43.8246 11.5789 34.0591 2.9859
temp: 298.150 k
press: 1.00000 atm
elementType: 8 8 7 6 6 6 6 6 6 6 6 6 6 6 6 6 6 6 1 1 1 1 1 1 1 1 1 1 1 1 1 1 1 1 1 1 1 1 1 1 1
symmnumber: 1
zpe: 917222.0 jmol-1
zpe.correction: 0.349351 hartree
zpe.thermalcorrener: 0.370070 hartree
zpe.thermalcorrenthalpy: 0.371014 hartree
zpe.thermalcorrgfe: 0.296742 hartree
zpe.sumelectzpe: -789.195884 hartree
zpe.sumelectthermal: -789.175166 hartree
zpe.sumelectthermalent: -789.174221 hartree
zpe.sumelectthermalfe: -789.248494 hartree
dipole: 0.0778 2.5353 -1.0458
dipole: 2.7436
quadrupole: -90.7717 -108.7862 -111.1731
quadrupole: -0.1075 -1.4668 1.2105
quadrupole: 12.8053 -5.2092 -7.5961 -0.1075 -1.4668 1.2105
hfenergy: -789.5452353 hartree
pointgroup: C01 [X(C15H23N1O2)]
dipole: 0.0389227 0.9172528 0.5676712 debye
polarizability: 235.9983381|1.1385819|188.5284578|9.6433208|18.0411851|125.1728615 unknown
InChI: InChI=1S/C15H23NO2/c1-5-16(6-2)9-10-18-15(17)14-11-12(3)7-8-13(14)4/h7-8,11H,5-6,9-10H2,1-4H3
charge 0 multiplicity 1
41 atoms
O  -0.269624 -0.045471 0.021058
O  0.294953 -2.169136 -0.732102
N  -3.973611 0.494897 0.12838
C  -2.529414 0.774448 0.320051
C  -4.781715 1.70907 -0.159554
C  -4.546556 -0.349816 1.212464
C  -1.694861 -0.370876 -0.266306
C  -4.576939 2.240932 -1.590773
C  -5.753258 -1.187051 0.747703
C  2.061052 -0.635167 0.028374
C  3.155375 -1.538137 -0.168645
C  0.660746 -1.056487 -0.271785
C  2.299315 0.683105 0.512113
C  3.596295 1.148015 0.811769
C  4.454793 -1.056854 0.139304
C  4.677954 0.249587 0.616548
C  3.003713 -2.958836 -0.679514
C  3.835153 2.558102 1.322689
H  -2.259985 0.918311 1.393162
H  -2.262584 1.709219 -0.203416
H  -5.846185 1.439083 -0.035333
H  -4.574416 2.523469 0.580721
H  -3.75355 -1.038385 1.559509
H  -4.833266 0.269914 2.099856
H  -1.838644 -0.451193 -1.357753
H  -1.940207 -1.348072 0.186782
H  -3.528959 2.54107 -1.773848
H  -4.840473 1.461358 -2.326428
H  -5.213688 3.127837 -1.768273
H  -6.588301 -0.550838 0.402465
H  -5.459179 -1.844008 -0.089063
H  -6.131217 -1.813927 1.576968
H  1.438591 1.34363 0.649387
H  5.307856 -1.730862 -0.002174
H  5.701203 0.576963 0.840451
H  2.33781 -3.556369 -0.032738
H  2.537516 -2.98365 -1.679959
H  3.990076 -3.451835 -0.731208
H  2.887975 3.112856 1.433289
H  4.338334 2.549936 2.307878
H  4.482621 3.131366 0.632449
