program: Orca
programVersion: 5.0.2
elementType: Cl Cl F F F O O O N N N C C C C C C C C C C C C C C C H H H H H H H H H H H H H H
charge: 0
multiplicity: 1
keywords: wb97x-d3
keywords: def2-TZVPP
keywords: def2/J RIJCOSX
keywords: DEFGRID2
keywords: scfconv7
keywords: smallprint printgap noloewdin
keywords: NOSOSCF
formula: C15H14Cl2F3N3O3
InChI: InChI=1/C15H14Cl2F3N3O3/c1-3-26-13(24)10(17)4-8-5-12(11(18)6-9(8)16)23-15(25)22(14(19)20)7(2)21-23/h5-6,10,14H,3-4H2,1-2H3
40 atoms
Cl -4.045929 1.082587 3.065758
Cl -3.740838 -1.684842 -1.300394
F  1.099016 -1.589583 -2.522391
F  6.139503 -0.216314 -0.543744
F  5.540374 1.544651 0.558955
O  -3.662174 1.587135 0.057714
O  2.560207 0.747758 -1.744191
O  -1.784104 2.581477 0.763383
N  1.938679 -0.715204 -0.043958
N  3.94953 0.023265 -0.008426
N  2.519157 -1.225354 1.081476
C  -1.734486 -0.975902 0.404228
C  -2.737068 -0.718599 1.498339
C  0.584749 -0.940488 -0.324239
C  -0.381649 -0.760502 0.651644
C  -2.648532 0.722096 1.993214
C  2.776208 0.100499 -0.744562
C  -2.08998 -1.381304 -0.882116
C  3.723818 -0.783569 1.091527
C  0.183672 -1.363773 -1.582509
C  -1.144028 -1.576569 -1.876651
C  5.140744 0.681026 -0.398854
C  4.718579 -1.093667 2.139398
C  -2.642478 1.743881 0.872408
C  -3.777583 2.466508 -1.078474
C  -2.914147 2.024184 -2.235585
H  -2.548434 -1.383134 2.343311
H  -3.748076 -0.923646 1.154937
H  -0.065792 -0.447239 1.639302
H  -1.754958 0.880038 2.593863
H  -1.428424 -1.907183 -2.86696
H  4.984086 1.214823 -1.334459
H  4.26143 -1.751847 2.874446
H  5.053619 -0.190836 2.649453
H  5.594301 -1.594806 1.729318
H  -4.831438 2.422669 -1.347057
H  -3.550887 3.490216 -0.77868
H  -1.851503 2.045462 -1.996847
H  -3.179121 1.022857 -2.573299
H  -3.077264 2.706174 -3.071482
elementType: Cl F O N C H
totalener: -2190.11531192 hartree
nucrepener: 2798.39377052 hartree
electener: -4988.50908243 hartree
oneelecener: -8578.95079452 hartree
twoeener: 3590.44171209 hartree
cpcmener: -0.03414380 hartree
kineticenergy: 2183.91067850 hartree
xcener: -156.796865816504 hartree
chargesum: 0.0000000
charge: -0.152385 -0.071571 -0.199950 -0.204479 -0.204093 -0.263094 -0.489189 -0.426528 0.045759 -0.158195 -0.309870 0.029623 -0.123711 0.016820 -0.146968 0.090039 0.394357 -0.020776 0.215677 0.241552 -0.113832 0.399413 -0.250504 0.331237 0.020489 -0.253890 0.124816 0.097638 0.135840 0.138742 0.134592 0.126853 0.107572 0.120438 0.120153 0.113473 0.098865 0.093222 0.081898 0.109966
qa: -0.1524 -0.0716 -0.1999 -0.2045 -0.2041 -0.2631 -0.4892 -0.4265 0.0458 -0.1582 -0.3099 0.0296 -0.1237 0.0168 -0.1470 0.0900 0.3944 -0.0208 0.2157 0.2416 -0.1138 0.3994 -0.2505 0.3312 0.0205 -0.2539 0.1248 0.0976 0.1358 0.1387 0.1346 0.1269 0.1076 0.1204 0.1202 0.1135 0.0989 0.0932 0.0819 0.1100
va: 1.1472 1.2462 1.1017 1.0793 1.0799 2.1622 2.0429 2.0700 3.1780 3.2554 2.9265 3.6931 3.8494 3.7499 4.0059 3.9182 4.3052 3.8856 3.9894 4.0774 3.9382 4.1740 3.9238 4.2502 3.8471 3.9082 1.0125 1.0467 1.0231 1.0243 1.0129 1.0006 1.0136 1.0001 1.0008 0.9948 1.0101 1.0130 1.0102 1.0093
dispcorr: -0.023349229 hartree
energy: -2190.138661144306
dipole: -7.08708 7.42947 0.34240 6.18547 -7.15912 -0.97365 0.71186 -0.16672 0.54514
magnitude: 1.16722 au
magnitude: 2.96684 debye
