program: Orca
programVersion: 5.0.2
elementType: Cl Cl F F F O O O N N N C C C C C C C C C C C C C C C H H H H H H H H H H H H H H
charge: 0
multiplicity: 1
keywords: wb97x-d3
keywords: def2-TZVPP
keywords: def2/J RIJCOSX
keywords: DEFGRID2
keywords: scfconv7
keywords: smallprint printgap noloewdin
keywords: NOSOSCF
formula: C15H14Cl2F3N3O3
InChI: InChI=1/C15H14Cl2F3N3O3/c1-3-26-13(24)10(17)4-8-5-12(11(18)6-9(8)16)23-15(25)22(14(19)20)7(2)21-23/h5-6,10,14H,3-4H2,1-2H3
40 atoms
Cl -1.759963 2.377093 -0.016702
Cl -3.563483 -2.091706 -0.491204
F  1.22717 -3.159672 -1.470674
F  6.437971 -0.975805 -0.729522
F  5.801812 1.084481 -0.905663
O  -4.735035 2.811449 0.561792
O  2.831949 -0.879514 -2.261557
O  -4.170778 1.882296 2.516261
N  2.211611 -1.034963 -0.014752
N  4.245558 -0.499984 -0.439982
N  2.811547 -0.80079 1.187983
C  -1.440293 -0.753683 0.533775
C  -2.389235 0.091933 1.330275
C  0.839234 -1.297601 -0.096664
C  -0.072863 -0.522589 0.600902
C  -3.017384 1.212203 0.518073
C  3.048231 -0.824488 -1.080202
C  -1.872184 -1.777318 -0.306222
C  4.026012 -0.489165 0.924904
C  0.366919 -2.346978 -0.870099
C  -0.9852 -2.579411 -1.004217
C  5.424848 -0.189174 -1.148061
C  5.049641 -0.178291 1.948852
C  -4.03334 1.997448 1.33116
C  -5.693094 3.66095 1.205658
C  -6.289289 4.564165 0.15374
H  -1.874428 0.518965 2.190683
H  -3.193994 -0.526047 1.733626
H  0.298709 0.28014 1.223564
H  -3.48515 0.830243 -0.390507
H  -1.333822 -3.391141 -1.627021
H  5.256845 -0.328724 -2.215403
H  5.86357 -0.902217 1.929783
H  4.581086 -0.209869 2.928751
H  5.479928 0.811146 1.798768
H  -6.461128 3.048969 1.684271
H  -5.201832 4.240855 1.989745
H  -7.026694 5.220227 0.615499
H  -5.528889 5.189699 -0.31225
H  -6.791829 3.994597 -0.627232
totalener: -2190.09153729 hartree
nucrepener: 2690.97886650 hartree
electener: -4881.07040379 hartree
oneelecener: -8364.16203590 hartree
twoeener: 3483.09163211 hartree
kineticenergy: 2183.99005570 hartree
xcener: -156.802726014239 hartree
chargesum: -0.0000000
charge: -0.126087 -0.070124 -0.181869 -0.193059 -0.193108 -0.256133 -0.381487 -0.346363 0.014605 -0.180391 -0.268768 0.051789 -0.206738 0.002051 -0.087560 0.094641 0.341119 0.017938 0.190343 0.231821 -0.135715 0.386874 -0.259482 0.289254 0.026881 -0.228155 0.114650 0.122813 0.115037 0.116206 0.121291 0.111874 0.112996 0.108747 0.111379 0.090858 0.090207 0.078731 0.088658 0.084276
qa: -0.1261 -0.0701 -0.1819 -0.1931 -0.1931 -0.2561 -0.3815 -0.3464 0.0146 -0.1804 -0.2688 0.0518 -0.2067 0.0021 -0.0876 0.0946 0.3411 0.0179 0.1903 0.2318 -0.1357 0.3869 -0.2595 0.2893 0.0269 -0.2282 0.1146 0.1228 0.1150 0.1162 0.1213 0.1119 0.1130 0.1087 0.1114 0.0909 0.0902 0.0787 0.0887 0.0843
va: 1.1688 1.2584 1.1276 1.0917 1.0925 2.1680 2.1546 2.1514 3.1675 3.2419 2.9252 3.5212 3.8961 3.8382 4.0308 3.8748 4.3333 3.9474 3.9838 4.1141 3.9741 4.1926 3.9243 4.2827 3.8790 3.9575 1.0240 1.0192 1.0409 1.0446 1.0155 1.0056 1.0011 1.0146 1.0036 0.9961 0.9985 1.0082 1.0057 1.0054
dispcorr: -0.020031577 hartree
energy: -2190.111568866148
dipole: -23.50693 23.18206 -0.32487 19.98684 -19.50090 0.48594 13.71227 -13.13657 0.57571
magnitude: 0.82043 au
magnitude: 2.08537 debye
