program: Orca
programVersion: 5.0.2
elementType: Cl Cl F F F O O O N N N C C C C C C C C C C C C C C C H H H H H H H H H H H H H H
charge: 0
multiplicity: 1
keywords: wb97x-d3
keywords: def2-TZVPP
keywords: def2/J RIJCOSX
keywords: DEFGRID2
keywords: scfconv7
keywords: smallprint printgap noloewdin
keywords: NOSOSCF
formula: C15H14Cl2F3N3O3
InChI: InChI=1/C15H14Cl2F3N3O3/c1-3-26-13(24)10(17)4-8-5-12(11(18)6-9(8)16)23-15(25)22(14(19)20)7(2)21-23/h5-6,10,14H,3-4H2,1-2H3
40 atoms
Cl -4.069806 0.783286 3.204038
Cl -3.717034 -1.603375 -1.209399
F  1.09665 -1.521626 -2.53754
F  6.153227 0.13348 -0.598249
F  5.405627 1.761271 0.613174
O  -2.253052 1.778654 0.001974
O  2.48374 0.86462 -1.692597
O  -4.456122 1.493628 0.321154
N  1.990103 -0.720637 -0.05233
N  3.95686 0.138015 -0.02913
N  2.62512 -1.235758 1.039719
C  -1.659698 -1.076176 0.487293
C  -2.633829 -0.86812 1.614288
C  0.636922 -0.98068 -0.298286
C  -0.30438 -0.871888 0.711224
C  -2.858882 0.621051 1.914733
C  2.756897 0.182265 -0.73974
C  -2.050836 -1.391541 -0.812314
C  3.800122 -0.723698 1.041403
C  0.208623 -1.342437 -1.567485
C  -1.128327 -1.534137 -1.836851
C  5.077112 0.919477 -0.388483
C  4.837709 -1.020318 2.055134
C  -3.32152 1.358867 0.666983
C  -2.441592 2.310885 -1.31505
C  -1.079726 2.664282 -1.862233
H  -2.254111 -1.338839 2.522533
H  -3.595934 -1.32912 1.396502
H  0.036362 -0.609737 1.705439
H  -1.934122 1.070059 2.278796
H  -1.441485 -1.8067 -2.834962
H  4.847808 1.486358 -1.28993
H  4.4352 -1.738321 2.764619
H  5.133921 -0.12314 2.597604
H  5.731605 -1.445227 1.600575
H  -2.938414 1.56253 -1.937392
H  -3.09328 3.186031 -1.269772
H  -1.183835 3.048406 -2.876663
H  -0.596665 3.436075 -1.263771
H  -0.416579 1.800283 -1.900142
totalener: -2190.08687890 hartree
nucrepener: 2816.70050683 hartree
electener: -5006.78738573 hartree
oneelecener: -8615.12656193 hartree
twoeener: 3608.33917620 hartree
kineticenergy: 2183.98958272 hartree
xcener: -156.803229209214 hartree
chargesum: -0.0000000
charge: -0.109430 -0.043258 -0.181061 -0.191024 -0.192160 -0.256302 -0.397801 -0.307788 0.029286 -0.175488 -0.275322 -0.013548 -0.197911 -0.032535 -0.069434 0.078872 0.350223 0.029707 0.194622 0.247060 -0.138727 0.385263 -0.258473 0.255555 0.008288 -0.216347 0.112810 0.125956 0.110655 0.111312 0.121419 0.112780 0.109701 0.112379 0.113424 0.091240 0.108793 0.081276 0.081820 0.084172
qa: -0.1094 -0.0433 -0.1811 -0.1910 -0.1922 -0.2563 -0.3978 -0.3078 0.0293 -0.1755 -0.2753 -0.0135 -0.1979 -0.0325 -0.0694 0.0789 0.3502 0.0297 0.1946 0.2471 -0.1387 0.3853 -0.2585 0.2556 0.0083 -0.2163 0.1128 0.1260 0.1107 0.1113 0.1214 0.1128 0.1097 0.1124 0.1134 0.0912 0.1088 0.0813 0.0818 0.0842
va: 1.1946 1.2822 1.1272 1.0948 1.0933 2.1145 2.1291 2.1942 3.1525 3.2482 2.9228 3.6669 3.8636 3.8398 4.0301 3.9847 4.3089 3.9239 3.9746 4.0562 3.9580 4.1934 3.9248 4.2825 3.8602 3.9581 1.0178 1.0325 1.0282 1.0291 1.0186 1.0052 1.0146 1.0021 1.0021 0.9985 1.0016 1.0118 1.0073 1.0073
dispcorr: -0.023939160 hartree
energy: -2190.110818059964
dipole: 0.94127 0.72645 1.66772 7.46712 -7.76687 -0.29975 0.82388 -0.52076 0.30313
magnitude: 1.72134 au
magnitude: 4.37531 debye
