program: Orca
programVersion: 5.0.2
elementType: Cl Cl F F F O O O N N N C C C C C C C C C C C C C C C H H H H H H H H H H H H H H
charge: 0
multiplicity: 1
keywords: wb97x-d3
keywords: def2-TZVPP
keywords: def2/J RIJCOSX
keywords: DEFGRID2
keywords: scfconv7
keywords: smallprint printgap noloewdin
keywords: NOSOSCF
formula: C15H14Cl2F3N3O3
InChI: InChI=1/C15H14Cl2F3N3O3/c1-3-26-13(24)10(17)4-8-5-12(11(18)6-9(8)16)23-15(25)22(14(19)20)7(2)21-23/h5-6,10,14H,3-4H2,1-2H3
40 atoms
Cl -5.010989 1.42185 -1.261186
Cl -3.707779 -2.870066 0.46759
F  1.199522 -2.952699 1.451115
F  4.857208 2.100344 0.374181
F  5.909817 0.215673 0.485898
O  -2.162982 2.18117 -0.364435
O  2.329652 -0.201061 2.060495
O  -2.973322 1.577959 1.637211
N  1.759618 -0.75849 -0.132427
N  3.66473 0.179562 0.17713
N  2.313903 -0.58803 -1.368397
C  -1.901184 -1.129254 -0.553928
C  -3.012428 -0.414549 -1.271159
C  0.457821 -1.257569 0.008692
C  -0.596819 -0.66875 -0.669405
C  -3.800346 0.487619 -0.324344
C  2.541042 -0.265455 0.87842
C  -2.117288 -2.224512 0.281215
C  3.451462 -0.032088 -1.172765
C  0.198878 -2.349955 0.821262
C  -1.083098 -2.838106 0.968182
C  4.749994 0.824857 0.807296
C  4.408788 0.313492 -2.247852
C  -2.93757 1.470882 0.44543
C  -1.322882 3.18251 0.22371
C  -0.01811 2.614307 0.739718
H  -3.706073 -1.124065 -1.724539
H  -2.599769 0.187248 -2.080428
H  -0.389428 0.174134 -1.314632
H  -4.354386 -0.100418 0.40448
H  -1.265422 -3.693798 1.602942
H  4.604496 0.810732 1.887113
H  4.646491 1.376554 -2.24834
H  3.964426 0.054998 -3.205182
H  5.342756 -0.236658 -2.139137
H  -1.142604 3.895337 -0.579883
H  -1.861567 3.698662 1.019406
H  0.589349 3.42452 1.144432
H  -0.170992 1.888236 1.536288
H  0.556866 2.144211 -0.058404
totalener: -2190.08967576 hartree
nucrepener: 2822.05800454 hartree
electener: -5012.14768029 hartree
oneelecener: -8625.68556459 hartree
twoeener: 3613.53788429 hartree
kineticenergy: 2183.97275073 hartree
xcener: -156.800108448376 hartree
chargesum: -0.0000000
charge: -0.126839 -0.057153 -0.181300 -0.194257 -0.191575 -0.266250 -0.380467 -0.330944 0.030607 -0.165474 -0.258277 -0.005161 -0.203663 0.036475 -0.152170 0.062700 0.312497 0.055174 0.182211 0.244490 -0.138759 0.386843 -0.260356 0.312635 0.013818 -0.249869 0.120679 0.108089 0.127051 0.127706 0.121326 0.113252 0.111147 0.109621 0.113420 0.100675 0.098818 0.100439 0.119488 0.053354
qa: -0.1268 -0.0572 -0.1813 -0.1943 -0.1916 -0.2663 -0.3805 -0.3309 0.0306 -0.1655 -0.2583 -0.0052 -0.2037 0.0365 -0.1522 0.0627 0.3125 0.0552 0.1822 0.2445 -0.1388 0.3868 -0.2604 0.3126 0.0138 -0.2499 0.1207 0.1081 0.1271 0.1277 0.1213 0.1133 0.1111 0.1096 0.1134 0.1007 0.0988 0.1004 0.1195 0.0534
va: 1.1739 1.2708 1.1306 1.0905 1.0943 2.1398 2.1449 2.1637 3.1432 3.2370 2.9147 3.6527 3.8885 3.7476 3.9966 3.9503 4.3373 3.9670 3.9826 4.1295 3.9862 4.1909 3.9258 4.2127 3.8844 3.8883 1.0184 1.0301 1.0206 1.0372 1.0164 1.0052 1.0037 1.0144 1.0011 0.9934 1.0109 1.0127 1.0143 1.0062
dispcorr: -0.024271362 hartree
energy: -2190.113947118622
dipole: 5.05406 -3.91917 1.13490 15.01439 -14.79571 0.21868 -7.03373 5.78514 -1.24859
magnitude: 1.70141 au
magnitude: 4.32463 debye
