program: Orca
programVersion: 5.0.2
elementType: Cl Cl F F F O O O N N N C C C C C C C C C C C C C C C H H H H H H H H H H H H H H
charge: 0
multiplicity: 1
keywords: wb97x-d3
keywords: def2-TZVPP
keywords: def2/J RIJCOSX
keywords: DEFGRID2
keywords: scfconv7
keywords: smallprint printgap noloewdin
keywords: NOSOSCF
formula: C15H14Cl2F3N3O3
InChI: InChI=1/C15H14Cl2F3N3O3/c1-3-26-13(24)10(17)4-8-5-12(11(18)6-9(8)16)23-15(25)22(14(19)20)7(2)21-23/h5-6,10,14H,3-4H2,1-2H3
40 atoms
Cl -2.035843 2.20973 -0.830987
Cl -3.495681 -2.267211 0.200711
F  1.213489 -3.180638 -1.216553
F  6.193594 -0.271229 1.144919
F  6.425852 -0.808719 -0.938361
O  -5.039503 2.564996 -0.062925
O  3.309495 -2.648983 0.621913
O  -4.065758 2.513762 1.955434
N  2.191872 -0.78347 -0.233875
N  4.331565 -0.673851 -0.09215
N  2.545578 0.473902 -0.628798
C  -1.414167 -0.569594 0.577014
C  -2.360019 0.415819 1.197201
C  0.841889 -1.136622 -0.120138
C  -0.065786 -0.262509 0.45797
C  -3.144814 1.206248 0.163463
C  3.265448 -1.54032 0.159401
C  -1.831433 -1.807145 0.092488
C  3.822566 0.528871 -0.54579
C  0.377725 -2.349397 -0.607472
C  -0.950413 -2.700968 -0.491851
C  5.672655 -1.032454 0.15903
C  4.630366 1.718715 -0.898581
C  -4.126512 2.16931 0.808887
C  -5.998529 3.539823 0.36525
C  -5.441303 4.945347 0.305499
H  -1.8143 1.107325 1.838642
H  -3.074453 -0.100201 1.842461
H  0.292739 0.693111 0.81646
H  -3.666387 0.546647 -0.530523
H  -1.289891 -3.653016 -0.874927
H  5.721046 -2.083776 0.44101
H  5.255078 2.039957 -0.065958
H  3.956382 2.5295 -1.161917
H  5.282658 1.52068 -1.748343
H  -6.831612 3.424124 -0.326644
H  -6.354778 3.300987 1.36869
H  -6.231755 5.657547 0.543964
H  -4.63582 5.091895 1.023114
H  -5.068469 5.18025 -0.690972
totalener: -2190.09122695 hartree
nucrepener: 2696.19910245 hartree
electener: -4886.29032940 hartree
oneelecener: -8374.63298988 hartree
twoeener: 3488.34266048 hartree
kineticenergy: 2183.98354118 hartree
xcener: -156.802634407699 hartree
chargesum: -0.0000000
charge: -0.122889 -0.070312 -0.180054 -0.192470 -0.193113 -0.259256 -0.380398 -0.351856 0.022692 -0.180864 -0.267752 0.060757 -0.207835 -0.002368 -0.092412 0.083817 0.336978 0.013721 0.190680 0.240971 -0.140969 0.385163 -0.259117 0.296060 0.026065 -0.251177 0.112977 0.123518 0.111181 0.118126 0.120369 0.112455 0.110349 0.110177 0.113025 0.100288 0.089917 0.084045 0.100356 0.089154
qa: -0.1229 -0.0703 -0.1801 -0.1925 -0.1931 -0.2593 -0.3804 -0.3519 0.0227 -0.1809 -0.2678 0.0608 -0.2078 -0.0024 -0.0924 0.0838 0.3370 0.0137 0.1907 0.2410 -0.1410 0.3852 -0.2591 0.2961 0.0261 -0.2512 0.1130 0.1235 0.1112 0.1181 0.1204 0.1125 0.1103 0.1102 0.1130 0.1003 0.0899 0.0840 0.1004 0.0892
va: 1.1718 1.2581 1.1294 1.0926 1.0918 2.1656 2.1530 2.1410 3.1638 3.2410 2.9194 3.5175 3.9052 3.8441 4.0212 3.8614 4.3353 3.9448 3.9821 4.1045 3.9821 4.1946 3.9246 4.2874 3.8782 3.9171 1.0264 1.0174 1.0422 1.0456 1.0165 1.0049 1.0040 1.0143 1.0007 0.9947 1.0093 1.0091 1.0110 1.0056
dispcorr: -0.020459588 hartree
energy: -2190.111686542643
dipole: -22.77715 22.30325 -0.47390 27.65305 -26.63813 1.01492 3.99876 -4.40403 -0.40527
magnitude: 1.19117 au
magnitude: 3.02771 debye
