program: Orca
programVersion: 5.0.2
elementType: Cl Cl F F F O O O N N N C C C C C C C C C C C C C C C H H H H H H H H H H H H H H
charge: 0
multiplicity: 1
keywords: wb97x-d3
keywords: def2-TZVPP
keywords: def2/J RIJCOSX
keywords: DEFGRID2
keywords: scfconv7
keywords: smallprint printgap noloewdin
keywords: NOSOSCF
formula: C15H14Cl2F3N3O3
InChI: InChI=1/C15H14Cl2F3N3O3/c1-3-26-13(24)10(17)4-8-5-12(11(18)6-9(8)16)23-15(25)22(14(19)20)7(2)21-23/h5-6,10,14H,3-4H2,1-2H3
40 atoms
Cl -4.902625 1.404457 -1.360353
Cl -3.612059 -2.610999 0.604076
F  1.309167 -2.946969 1.442651
F  5.19472 1.858678 0.120096
F  6.148793 -0.081255 0.211899
O  -2.902924 2.337136 1.065096
O  2.62795 -0.33619 1.907095
O  -1.738712 2.24749 -0.848273
N  1.949032 -0.86804 -0.261667
N  3.896087 0.003999 -0.027752
N  2.456244 -0.707023 -1.518372
C  -1.734835 -1.060653 -0.591449
C  -2.832414 -0.358418 -1.343178
C  0.625825 -1.285687 -0.070034
C  -0.410521 -0.675222 -0.758523
C  -3.51856 0.680411 -0.471252
C  2.78774 -0.403921 0.717057
C  -1.989979 -2.082608 0.321986
C  3.619401 -0.191717 -1.368471
C  0.32831 -2.316441 0.808337
C  -0.974804 -2.71462 1.020226
C  5.033582 0.592851 0.563436
C  4.537285 0.137993 -2.482043
C  -2.602509 1.840343 -0.122179
C  -2.189004 3.498996 1.507368
C  -2.736384 4.768819 0.892155
H  -3.580685 -1.074314 -1.683915
H  -2.426436 0.129359 -2.228887
H  -0.174975 0.124177 -1.448138
H  -3.933064 0.232544 0.430693
H  -1.187876 -3.518751 1.710337
H  4.921374 0.590467 1.647279
H  4.0511 -0.116451 -3.419792
H  5.469408 -0.421162 -2.41034
H  4.785048 1.19871 -2.494591
H  -2.322471 3.503689 2.587992
H  -1.124229 3.386344 1.297297
H  -2.573846 4.800818 -0.183625
H  -3.802811 4.875663 1.087784
H  -2.228718 5.628574 1.330487
totalener: -2190.09287314 hartree
nucrepener: 2751.02551876 hartree
electener: -4941.11839190 hartree
oneelecener: -8484.13872597 hartree
twoeener: 3543.02033406 hartree
kineticenergy: 2183.97568078 hartree
xcener: -156.800558872842 hartree
chargesum: -0.0000000
charge: -0.124783 -0.062080 -0.180980 -0.193538 -0.192491 -0.257004 -0.385171 -0.366179 0.015146 -0.180318 -0.266353 -0.016528 -0.183986 0.020495 -0.100153 0.073855 0.342271 0.031469 0.191676 0.235869 -0.138520 0.385821 -0.259950 0.318810 0.030172 -0.250653 0.117322 0.115538 0.128871 0.119201 0.121223 0.111641 0.109610 0.111991 0.112122 0.101745 0.090423 0.100905 0.088367 0.084142
qa: -0.1248 -0.0621 -0.1810 -0.1935 -0.1925 -0.2570 -0.3852 -0.3662 0.0151 -0.1803 -0.2664 -0.0165 -0.1840 0.0205 -0.1002 0.0739 0.3423 0.0315 0.1917 0.2359 -0.1385 0.3858 -0.2599 0.3188 0.0302 -0.2507 0.1173 0.1155 0.1289 0.1192 0.1212 0.1116 0.1096 0.1120 0.1121 0.1017 0.0904 0.1009 0.0884 0.0841
va: 1.1710 1.2659 1.1297 1.0919 1.0927 2.1664 2.1516 2.1238 3.1593 3.2420 2.9252 3.6509 3.8639 3.7830 3.9856 3.9229 4.3332 3.9482 3.9815 4.1254 3.9727 4.1933 3.9235 4.2274 3.8731 3.9158 1.0237 1.0271 1.0358 1.0437 1.0164 1.0057 1.0146 1.0016 1.0030 0.9946 1.0104 1.0112 1.0056 1.0092
dispcorr: -0.021032831 hartree
energy: -2190.113905974154
dipole: -4.03350 4.43503 0.40153 20.79564 -20.43187 0.36377 -4.06196 3.88822 -0.17374
magnitude: 0.56898 au
magnitude: 1.44624 debye
