program: Orca
programVersion: 5.0.2
elementType: Cl Cl F F F O O O N N N C C C C C C C C C C C C C C C H H H H H H H H H H H H H H
charge: 0
multiplicity: 1
keywords: wb97x-d3
keywords: def2-TZVPP
keywords: def2/J RIJCOSX
keywords: DEFGRID2
keywords: scfconv7
keywords: smallprint printgap noloewdin
keywords: NOSOSCF
formula: C15H14Cl2F3N3O3
InChI: InChI=1/C15H14Cl2F3N3O3/c1-3-26-13(24)10(17)4-8-5-12(11(18)6-9(8)16)23-15(25)22(14(19)20)7(2)21-23/h5-6,10,14H,3-4H2,1-2H3
40 atoms
Cl -4.613635 0.604113 -0.193591
Cl -3.689874 -2.660106 -0.665218
F  0.985172 -1.791623 -2.200746
F  5.532883 0.242616 1.663768
F  5.850946 0.458515 -0.462588
O  -2.268653 2.161691 0.042823
O  2.985574 -2.136856 0.029327
O  -2.140636 2.244823 2.274867
N  1.640835 -0.231778 -0.031877
N  3.74482 0.062164 0.276564
N  1.828302 1.111118 0.122778
C  -1.925339 -1.02799 0.608837
C  -2.972434 -0.637104 1.612945
C  0.357535 -0.773248 -0.185816
C  -0.639023 -0.515223 0.739238
C  -3.654088 0.702331 1.300653
C  2.801836 -0.949851 0.075664
C  -2.165209 -1.878778 -0.469696
C  3.086622 1.277024 0.301465
C  0.059146 -1.578064 -1.273842
C  -1.184395 -2.154807 -1.410828
C  5.119741 -0.202995 0.458121
C  3.736213 2.593483 0.492641
C  -2.615411 1.8113 1.258782
C  -1.181216 3.085855 -0.106406
C  -0.81356 3.119437 -1.569016
H  -2.512817 -0.538207 2.598931
H  -3.742533 -1.402062 1.702424
H  -0.399368 0.112656 1.589052
H  -4.345881 0.933963 2.110785
H  -1.388055 -2.802529 -2.251847
H  5.295547 -1.275301 0.376855
H  4.460789 2.797757 -0.294743
H  4.256909 2.648809 1.447802
H  2.971796 3.365562 0.468922
H  -1.4928 4.068645 0.254537
H  -0.331662 2.756122 0.493443
H  -1.648633 3.439354 -2.191152
H  0.007346 3.820123 -1.719621
H  -0.479652 2.140467 -1.910451
totalener: -2190.08749893 hartree
nucrepener: 2853.24513861 hartree
electener: -5043.33263754 hartree
oneelecener: -8688.51436142 hartree
twoeener: 3645.18172388 hartree
kineticenergy: 2183.99676064 hartree
xcener: -156.807339417785 hartree
chargesum: -0.0000000
charge: -0.116413 -0.049355 -0.183773 -0.192599 -0.192019 -0.236182 -0.379600 -0.349404 0.050381 -0.179487 -0.285365 0.077430 -0.208916 -0.018490 -0.201572 0.090190 0.337651 0.029013 0.204548 0.236898 -0.124234 0.386282 -0.265288 0.259282 0.011191 -0.227522 0.125364 0.108818 0.141372 0.125455 0.119665 0.112657 0.114775 0.114890 0.105951 0.110947 0.091458 0.096667 0.073413 0.085920
qa: -0.1164 -0.0494 -0.1838 -0.1926 -0.1920 -0.2362 -0.3796 -0.3494 0.0504 -0.1795 -0.2854 0.0774 -0.2089 -0.0185 -0.2016 0.0902 0.3377 0.0290 0.2045 0.2369 -0.1242 0.3863 -0.2653 0.2593 0.0112 -0.2275 0.1254 0.1088 0.1414 0.1255 0.1197 0.1127 0.1148 0.1149 0.1060 0.1109 0.0915 0.0967 0.0734 0.0859
va: 1.1940 1.2720 1.1264 1.0932 1.0931 2.1606 2.1585 2.1526 3.1166 3.2489 2.9374 3.6183 3.9111 3.7330 4.0107 4.0444 4.3302 3.9772 3.9708 4.1054 3.9689 4.1934 3.9444 4.2897 3.8293 3.9512 1.0131 1.0247 1.0211 1.0148 1.0172 1.0057 1.0015 1.0031 1.0104 1.0019 1.0162 1.0074 1.0105 1.0049
dispcorr: -0.024218964 hartree
energy: -2190.111717897854
dipole: 0.39612 0.08545 0.48157 22.43462 -21.48523 0.94939 4.28809 -4.21125 0.07684
magnitude: 1.06731 au
magnitude: 2.71290 debye
