program: Orca
programVersion: 5.0.2
elementType: Cl Cl F F F O O O N N N C C C C C C C C C C C C C C C H H H H H H H H H H H H H H
charge: 0
multiplicity: 1
keywords: wb97x-d3
keywords: def2-TZVPP
keywords: def2/J RIJCOSX
keywords: DEFGRID2
keywords: scfconv7
keywords: smallprint printgap noloewdin
keywords: NOSOSCF
formula: C15H14Cl2F3N3O3
InChI: InChI=1/C15H14Cl2F3N3O3/c1-3-26-13(24)10(17)4-8-5-12(11(18)6-9(8)16)23-15(25)22(14(19)20)7(2)21-23/h5-6,10,14H,3-4H2,1-2H3
40 atoms
Cl -5.025884 1.50322 -1.102037
Cl -3.640807 -2.83807 0.377045
F  1.297531 -2.969264 1.171201
F  5.156974 1.934746 0.514209
F  5.977354 -0.02731 0.122733
O  -2.154838 2.334253 -0.43972
O  2.5860 -0.559813 1.945705
O  -2.740858 1.68344 1.623784
N  1.79129 -0.638881 -0.251123
N  3.728453 0.230564 0.06752
N  2.216248 -0.17589 -1.4628
C  -1.869862 -1.039186 -0.610389
C  -3.004035 -0.300934 -1.264128
C  0.503092 -1.1665 -0.108329
C  -0.574759 -0.554509 -0.728208
C  -3.730538 0.591547 -0.261774
C  2.675342 -0.368013 0.762912
C  -2.057634 -2.177739 0.171094
C  3.376538 0.330394 -1.264291
C  0.276106 -2.318775 0.629511
C  -0.998606 -2.822284 0.786841
C  4.934985 0.615637 0.690737
C  4.211998 0.943134 -2.321913
C  -2.823906 1.591414 0.433169
C  -1.293479 3.356774 0.074344
C  0.077216 2.829442 0.442859
H  -3.727339 -0.995478 -1.692834
H  -2.62516 0.309414 -2.083493
H  -0.393782 0.324346 -1.331496
H  -4.214086 -0.004753 0.509799
H  -1.15253 -3.719117 1.370361
H  4.88583 0.384437 1.754522
H  5.160507 0.419617 -2.435558
H  4.432452 1.986814 -2.100597
H  3.6730 0.892574 -3.263935
H  -1.222023 4.086281 -0.731352
H  -1.762894 3.842748 0.93068
H  0.026893 2.086794 1.238014
H  0.583873 2.391804 -0.417915
H  0.693491 3.655175 0.800094
totalener: -2190.08970456 hartree
nucrepener: 2817.47339515 hartree
electener: -5007.56309971 hartree
oneelecener: -8616.50635055 hartree
twoeener: 3608.94325084 hartree
kineticenergy: 2183.98116205 hartree
xcener: -156.802567880279 hartree
chargesum: -0.0000000
charge: -0.127243 -0.059298 -0.178510 -0.192999 -0.191912 -0.265201 -0.375599 -0.330481 0.038512 -0.165639 -0.269863 -0.010541 -0.209694 0.026838 -0.133838 0.070776 0.323526 0.043802 0.181906 0.239609 -0.139026 0.386451 -0.261794 0.307173 0.018253 -0.258816 0.117985 0.111365 0.132951 0.126764 0.121292 0.113948 0.115226 0.111521 0.108839 0.101229 0.097272 0.114610 0.059732 0.100874
qa: -0.1272 -0.0593 -0.1785 -0.1930 -0.1919 -0.2652 -0.3756 -0.3305 0.0385 -0.1656 -0.2699 -0.0105 -0.2097 0.0268 -0.1338 0.0708 0.3235 0.0438 0.1819 0.2396 -0.1390 0.3865 -0.2618 0.3072 0.0183 -0.2588 0.1180 0.1114 0.1330 0.1268 0.1213 0.1139 0.1152 0.1115 0.1088 0.1012 0.0973 0.1146 0.0597 0.1009
va: 1.1736 1.2685 1.1320 1.0925 1.0938 2.1383 2.1535 2.1636 3.1473 3.2312 2.9028 3.6750 3.8932 3.8006 3.9557 3.9493 4.3323 3.9646 3.9811 4.1189 3.9851 4.1904 3.9262 4.2190 3.8863 3.8909 1.0217 1.0287 1.0188 1.0371 1.0160 1.0048 1.0025 1.0022 1.0145 0.9942 1.0113 1.0110 1.0084 1.0127
dispcorr: -0.023985586 hartree
energy: -2190.113690146267
dipole: 4.18972 -3.11262 1.07710 17.71189 -17.22498 0.48691 -7.60739 6.30679 -1.30060
magnitude: 1.75750 au
magnitude: 4.46720 debye
