program: Orca
programVersion: 5.0.2
elementType: Cl Cl F F F O O O N N N C C C C C C C C C C C C C C C H H H H H H H H H H H H H H
charge: 0
multiplicity: 1
keywords: wb97x-d3
keywords: def2-TZVPP
keywords: def2/J RIJCOSX
keywords: DEFGRID2
keywords: scfconv7
keywords: smallprint printgap noloewdin
keywords: NOSOSCF
formula: C15H14Cl2F3N3O3
InChI: InChI=1/C15H14Cl2F3N3O3/c1-3-26-13(24)10(17)4-8-5-12(11(18)6-9(8)16)23-15(25)22(14(19)20)7(2)21-23/h5-6,10,14H,3-4H2,1-2H3
40 atoms
Cl -4.98812 1.59035 -0.995261
Cl -3.672033 -2.812125 0.404791
F  1.283874 -3.033196 1.073287
F  4.757665 2.161145 0.639003
F  5.924154 0.393896 0.194386
O  -2.072623 2.328734 -0.421628
O  2.484133 -0.544462 1.905324
O  -2.616776 1.683889 1.655073
N  1.778909 -0.696607 -0.315744
N  3.667721 0.255775 0.056769
N  2.228265 -0.237666 -1.519735
C  -1.893576 -1.046454 -0.627105
C  -3.030724 -0.275073 -1.236641
C  0.486938 -1.218588 -0.182206
C  -0.592651 -0.585844 -0.776472
C  -3.694922 0.63268 -0.204435
C  2.612687 -0.370598 0.723251
C  -2.081905 -2.186138 0.153029
C  3.357763 0.322332 -1.288764
C  0.258608 -2.370933 0.553765
C  -1.019792 -2.85565 0.73687
C  4.767077 0.81442 0.744277
C  4.215126 0.932123 -2.330532
C  -2.737316 1.600638 0.467116
C  -1.162436 3.318542 0.073145
C  0.199578 2.742364 0.398462
H  -3.788911 -0.946861 -1.640451
H  -2.665434 0.328664 -2.06692
H  -0.410292 0.295113 -1.376262
H  -4.170378 0.045551 0.57927
H  -1.176614 -3.752099 1.320209
H  4.722726 0.52661 1.794151
H  4.450742 1.970437 -2.100431
H  3.687957 0.895433 -3.280009
H  5.155617 0.392348 -2.435877
H  -1.089758 4.050285 -0.730368
H  -1.59039 3.814114 0.945402
H  0.14776 1.999317 1.193198
H  0.663569 2.291295 -0.47934
H  0.855699 3.544302 0.738444
totalener: -2190.08964616 hartree
nucrepener: 2829.08463619 hartree
electener: -5019.17428236 hartree
oneelecener: -8639.71723872 hartree
twoeener: 3620.54295636 hartree
kineticenergy: 2183.97925189 hartree
xcener: -156.802047903429 hartree
chargesum: -0.0000000
charge: -0.127087 -0.058850 -0.179284 -0.193623 -0.190979 -0.265824 -0.376673 -0.329899 0.034352 -0.161013 -0.268864 -0.007324 -0.209355 0.036001 -0.140200 0.070758 0.320779 0.041988 0.177895 0.235102 -0.133803 0.385415 -0.260230 0.307749 0.018036 -0.260184 0.117895 0.111406 0.133946 0.126603 0.121283 0.114478 0.109999 0.108956 0.115311 0.101378 0.098362 0.115973 0.057798 0.101726
qa: -0.1271 -0.0588 -0.1793 -0.1936 -0.1910 -0.2658 -0.3767 -0.3299 0.0344 -0.1610 -0.2689 -0.0073 -0.2094 0.0360 -0.1402 0.0708 0.3208 0.0420 0.1779 0.2351 -0.1338 0.3854 -0.2602 0.3077 0.0180 -0.2602 0.1179 0.1114 0.1339 0.1266 0.1213 0.1145 0.1100 0.1090 0.1153 0.1014 0.0984 0.1160 0.0578 0.1017
va: 1.1738 1.2690 1.1323 1.0912 1.0946 2.1383 2.1508 2.1640 3.1471 3.2318 2.9016 3.6692 3.8935 3.7882 3.9699 3.9508 4.3316 3.9681 3.9829 4.1239 3.9797 4.1921 3.9288 4.2172 3.8871 3.8879 1.0219 1.0286 1.0176 1.0368 1.0157 1.0042 1.0045 1.0145 1.0001 0.9941 1.0112 1.0117 1.0086 1.0132
dispcorr: -0.024395074 hartree
energy: -2190.114041239272
dipole: 5.16362 -4.07449 1.08914 16.58071 -16.17033 0.41038 -7.99921 6.68081 -1.31840
magnitude: 1.75864 au
magnitude: 4.47011 debye
