program: Orca
programVersion: 5.0.2
elementType: Cl F F F O O O O O O N N C C C C C C C C C C C C C C C C C C C C H H H H H H H H H H H H H H H H H H
charge: 0
multiplicity: 1
keywords: wb97x-d3
keywords: def2-TZVPP
keywords: def2/J RIJCOSX
keywords: DEFGRID2
keywords: scfconv7
keywords: smallprint printgap noloewdin
keywords: NOSOSCF
formula: C20H18ClF3N2O6
InChI: InChI=1/C20H18ClF3N2O6/c1-5-8-31-17(29)19(2,3)32-16(28)12-9-11(6-7-13(12)21)26-15(27)10-14(20(22,23)24)25(4)18(26)30/h5-7,9-10H,1,8H2,2-4H3
50 atoms
Cl 3.390171 -3.545324 0.548206
F  -6.309385 0.784212 0.165673
F  -5.439547 2.300288 -1.102167
F  -6.183412 0.483179 -1.951485
O  2.977214 0.355077 -1.162405
O  2.625688 2.078896 0.76296
O  -1.511733 0.332974 1.540847
O  -2.089867 -2.08909 -2.239164
O  4.811621 2.569988 0.809172
O  3.986965 -0.608943 0.585866
N  -1.811094 -0.879283 -0.339856
N  -3.402305 0.715603 0.332586
C  3.866318 1.493854 -1.144737
C  -0.550716 -1.510576 -0.111994
C  -4.18334 0.335006 -0.731538
C  -2.203405 0.077632 0.578466
C  3.247568 2.497326 -2.11024
C  5.267865 1.121259 -1.591063
C  1.852467 -1.390672 -0.102783
C  0.613432 -0.79985 -0.331142
C  -2.529752 -1.259883 -1.466399
C  -3.802351 -0.604032 -1.609358
C  3.847769 2.095757 0.2643
C  -0.501915 -2.826368 0.313223
C  3.065388 -0.539395 -0.187396
C  1.894251 -2.721769 0.313937
C  -3.767458 1.812806 1.236496
C  0.724491 -3.438166 0.508434
C  -5.540382 0.986282 -0.904776
C  2.410575 2.426778 2.147776
C  2.752164 1.265336 3.02458
C  1.835787 0.416738 3.473884
H  3.27724 2.103698 -3.126289
H  2.21347 2.726707 -1.85611
H  3.818677 3.424761 -2.094829
H  5.868569 2.022007 -1.709125
H  5.781435 0.459789 -0.897691
H  5.21844 0.633215 -2.564409
H  0.554878 0.22935 -0.658322
H  -4.420757 -0.90239 -2.440559
H  -1.412132 -3.383792 0.490577
H  -2.987235 1.92492 1.97713
H  -3.843802 2.749398 0.692942
H  -4.69252 1.600254 1.76294
H  0.765442 -4.472531 0.819708
H  1.349705 2.662082 2.206941
H  2.978371 3.32108 2.405999
H  3.799056 1.113472 3.26473
H  2.106371 -0.432236 4.088474
H  0.78354 0.536602 3.243547
elementType: Cl F O N C H
totalener: -2093.80256925 hartree
nucrepener: 3618.49967574 hartree
electener: -5712.30224500 hartree
twoeener: 4362.04268465 hartree
cpcmener: -0.05613337 hartree
kineticenergy: 2086.82592608 hartree
xcener: -168.851503730431 hartree
chargesum: 0.0000000
charge: -0.055257 -0.161800 -0.161178 -0.159564 -0.294000 -0.266028 -0.504359 -0.495959 -0.450953 -0.427312 -0.051549 -0.085873 0.327416 0.087602 0.013678 0.431908 -0.296486 -0.302317 0.103346 -0.186406 0.371756 -0.150652 0.345381 -0.189620 0.377887 0.040271 -0.207121 -0.096557 0.540209 0.036346 -0.191082 -0.257348 0.112616 0.116578 0.115641 0.109493 0.111037 0.112056 0.142173 0.138822 0.159015 0.115918 0.141589 0.141958 0.142235 0.121022 0.121188 0.153969 0.136110 0.124204
qa: -0.0553 -0.1618 -0.1612 -0.1596 -0.2940 -0.2660 -0.5044 -0.4960 -0.4510 -0.4273 -0.0515 -0.0859 0.3274 0.0876 0.0137 0.4319 -0.2965 -0.3023 0.1033 -0.1864 0.3718 -0.1507 0.3454 -0.1896 0.3779 0.0403 -0.2071 -0.0966 0.5402 0.0363 -0.1911 -0.2573 0.1126 0.1166 0.1156 0.1095 0.1110 0.1121 0.1422 0.1388 0.1590 0.1159 0.1416 0.1420 0.1422 0.1210 0.1212 0.1540 0.1361 0.1242
va: 1.2642 1.1472 1.1475 1.1519 2.1579 2.1283 1.9999 2.0081 2.0579 2.0473 3.1338 3.3527 3.7303 3.6474 3.9828 4.1810 3.9304 3.9412 3.5439 4.1135 4.1761 3.8903 4.1995 4.1075 4.2231 3.9708 3.8389 3.9754 4.4094 3.8317 3.7489 3.9344 1.0032 1.0079 1.0041 1.0076 1.0173 1.0049 1.0367 1.0213 1.0016 1.0241 0.9929 0.9950 1.0083 1.0012 1.0113 1.0019 1.0023 1.0143
dispcorr: -0.030144654 hartree
energy: -2093.832713907098
dipole: 32.03865 -35.51074 -3.47209 17.02335 -15.58418 1.43917 7.37340 -7.58757 -0.21417
magnitude: 3.76464 au
magnitude: 9.56895 debye
