program: Orca
programVersion: 5.0.2
elementType: Cl F F F O O O O O O N N C C C C C C C C C C C C C C C C C C C C H H H H H H H H H H H H H H H H H H
charge: 0
multiplicity: 1
keywords: wb97x-d3
keywords: def2-TZVPP
keywords: def2/J RIJCOSX
keywords: DEFGRID2
keywords: scfconv7
keywords: smallprint printgap noloewdin
keywords: NOSOSCF
formula: C20H18ClF3N2O6
InChI: InChI=1/C20H18ClF3N2O6/c1-5-8-31-17(29)19(2,3)32-16(28)12-9-11(6-7-13(12)21)26-15(27)10-14(20(22,23)24)25(4)18(26)30/h5-7,9-10H,1,8H2,2-4H3
50 atoms
Cl 3.231343 -3.001069 -0.380804
F  -6.990871 -0.021062 0.73307
F  -6.28314 1.755147 -0.269283
F  -6.957594 0.06915 -1.405508
O  2.161712 1.047878 0.197946
O  5.414886 2.30819 -0.147905
O  -2.145286 -0.499442 1.831391
O  -2.601014 -1.770313 -2.486545
O  4.662068 0.764684 1.286057
O  3.394462 -0.138883 -1.24228
N  -2.36067 -1.084277 -0.339359
N  -4.101708 0.016532 0.7935
C  3.069167 2.16682 0.151142
C  -1.008434 -1.541915 -0.33437
C  -4.882419 -0.134349 -0.325735
C  -2.830935 -0.521408 0.831989
C  2.644419 3.067833 1.305204
C  2.947862 2.904097 -1.172399
C  1.341566 -1.034731 -0.43127
C  0.015283 -0.616369 -0.395287
C  -3.093901 -1.243409 -1.508028
C  -4.440147 -0.738598 -1.438702
C  4.468827 1.641804 0.481648
C  -0.730834 -2.896807 -0.286476
C  2.417781 -0.01637 -0.54804
C  1.614125 -2.402462 -0.393026
C  -4.566578 0.642968 2.036304
C  0.58415 -3.326464 -0.311228
C  -6.292617 0.421016 -0.311855
C  6.787334 1.990493 0.163212
C  7.199665 2.58559 1.467614
C  7.677919 1.869023 2.475751
H  2.649078 2.535696 2.256022
H  3.323355 3.916113 1.383398
H  1.641809 3.456269 1.125876
H  3.325984 2.339911 -2.022072
H  1.898438 3.137884 -1.353263
H  3.484997 3.850084 -1.126458
H  -0.222139 0.438378 -0.439694
H  -5.05648 -0.853087 -2.315854
H  -1.531093 -3.622051 -0.224353
H  -3.709003 1.028212 2.574237
H  -5.209125 1.489905 1.829694
H  -5.0834 -0.075445 2.668905
H  0.804924 -4.383592 -0.263809
H  7.351642 2.431137 -0.657801
H  6.941818 0.910836 0.141862
H  7.117807 3.664505 1.553454
H  8.005514 2.336983 3.394825
H  7.771991 0.791132 2.416039
elementType: Cl F O N C H
totalener: -2093.80602463 hartree
nucrepener: 3466.63108012 hartree
electener: -5560.43710475 hartree
oneelecener: -9771.44133461 hartree
twoeener: 4211.00422986 hartree
cpcmener: -0.06265407 hartree
kineticenergy: 2086.81122191 hartree
xcener: -168.848339375279 hartree
chargesum: -0.0000000
charge: -0.056528 -0.161040 -0.161961 -0.159047 -0.287883 -0.270196 -0.494269 -0.497434 -0.462983 -0.437898 -0.050816 -0.100125 0.321342 0.054794 0.015813 0.428140 -0.289700 -0.305877 0.060764 -0.143381 0.369946 -0.151255 0.345030 -0.176192 0.424743 0.042349 -0.188168 -0.113234 0.535154 0.076614 -0.205662 -0.246890 0.115941 0.110974 0.114107 0.114919 0.113239 0.109959 0.148863 0.138712 0.160185 0.116134 0.129314 0.141888 0.142060 0.118701 0.110568 0.144411 0.134478 0.121401
qa: -0.0565 -0.1610 -0.1620 -0.1590 -0.2879 -0.2702 -0.4943 -0.4974 -0.4630 -0.4379 -0.0508 -0.1001 0.3213 0.0548 0.0158 0.4281 -0.2897 -0.3059 0.0608 -0.1434 0.3699 -0.1513 0.3450 -0.1762 0.4247 0.0423 -0.1882 -0.1132 0.5352 0.0766 -0.2057 -0.2469 0.1159 0.1110 0.1141 0.1149 0.1132 0.1100 0.1489 0.1387 0.1602 0.1161 0.1293 0.1419 0.1421 0.1187 0.1106 0.1444 0.1345 0.1214
va: 1.2631 1.1507 1.1449 1.1518 2.1637 2.1701 2.0173 2.0066 2.0417 2.0541 3.1369 3.3741 3.7695 3.6606 3.9753 4.2105 3.9233 3.9390 3.6682 4.1110 4.1803 3.8831 4.2071 4.0957 4.1538 3.9677 3.8577 3.9961 4.4208 3.8414 3.8104 3.9377 1.0144 1.0056 1.0023 1.0152 1.0022 1.0077 1.0259 1.0214 1.0012 1.0112 1.0067 0.9873 1.0095 0.9961 1.0091 1.0008 1.0010 1.0077
dispcorr: -0.026687805 hartree
energy: -2093.832712433922
dipole: 45.89116 -48.05702 -2.16587 24.38545 -22.04163 2.34382 11.79118 -10.93666 0.85452
magnitude: 3.30374 au
magnitude: 8.39743 debye
