program: Orca
programVersion: 5.0.2
elementType: Cl F F F O O O O O O N N C C C C C C C C C C C C C C C C C C C C H H H H H H H H H H H H H H H H H H
charge: 0
multiplicity: 1
keywords: wb97x-d3
keywords: def2-TZVPP
keywords: def2/J RIJCOSX
keywords: DEFGRID2
keywords: scfconv7
keywords: smallprint printgap noloewdin
keywords: NOSOSCF
formula: C20H18ClF3N2O6
InChI: InChI=1/C20H18ClF3N2O6/c1-5-8-31-17(29)19(2,3)32-16(28)12-9-11(6-7-13(12)21)26-15(27)10-14(20(22,23)24)25(4)18(26)30/h5-7,9-10H,1,8H2,2-4H3
50 atoms
Cl 3.409707 -3.392558 -1.52506
F  -5.277489 2.074302 1.435596
F  -5.935279 1.677625 -0.561356
F  -6.303527 0.228939 0.971926
O  3.201897 -0.350574 1.107116
O  2.644246 2.100921 0.430696
O  -1.835092 -1.76928 1.715887
O  -1.695352 0.131571 -2.386074
O  4.80611 2.662563 0.33551
O  3.882437 -0.278096 -1.026145
N  -1.763488 -0.80368 -0.323979
N  -3.489005 -0.304387 1.18862
C  4.144581 0.662078 1.529032
C  -0.520346 -1.458173 -0.578155
C  -4.085341 0.452612 0.212019
C  -2.336535 -1.010503 0.914098
C  5.578653 0.169196 1.467466
C  3.754345 0.987227 2.965899
C  1.87674 -1.421673 -0.482058
C  0.650859 -0.842539 -0.179605
C  -2.281588 0.002574 -1.327895
C  -3.53649 0.627382 -1.000542
C  3.925069 1.915502 0.677227
C  -0.490729 -2.672458 -1.24135
C  3.10916 -0.6448 -0.179053
C  1.90304 -2.635395 -1.159873
C  -4.031305 -0.502169 2.537915
C  0.726577 -3.270711 -1.522894
C  -5.413748 1.113443 0.5195
C  2.240088 3.206559 -0.402269
C  0.750002 3.201831 -0.411777
C  0.028167 2.884432 -1.478687
H  6.23537 0.893419 1.947737
H  5.663793 -0.764403 2.023666
H  5.939392 0.004346 0.455434
H  4.366008 1.808649 3.33793
H  2.70662 1.273138 3.05162
H  3.934025 0.121583 3.603835
H  0.608346 0.106155 0.339365
H  -4.00639 1.226469 -1.764196
H  -1.409054 -3.156643 -1.545162
H  -3.207376 -0.568187 3.239181
H  -4.632242 0.340812 2.848936
H  -4.620445 -1.414607 2.592381
H  0.754535 -4.223423 -2.032907
H  2.64728 3.071135 -1.406038
H  2.629629 4.138127 0.012884
H  0.256458 3.47063 0.516614
H  -1.053505 2.904907 -1.449964
H  0.489571 2.614821 -2.421273
elementType: Cl F O N C H
totalener: -2093.80610922 hartree
nucrepener: 3616.53738268 hartree
electener: -5710.34349190 hartree
twoeener: 4359.59716516 hartree
cpcmener: -0.05918237 hartree
kineticenergy: 2086.81763562 hartree
xcener: -168.846275626965 hartree
chargesum: -0.0000000
charge: -0.059367 -0.162218 -0.157949 -0.162294 -0.281847 -0.262881 -0.498632 -0.500110 -0.454530 -0.429035 -0.019238 -0.098574 0.326352 0.053460 0.019548 0.434971 -0.305840 -0.295164 0.120456 -0.190112 0.341690 -0.154654 0.351662 -0.183543 0.361594 0.054952 -0.181405 -0.106200 0.537633 0.073597 -0.226594 -0.245564 0.109514 0.114213 0.112065 0.113015 0.116766 0.113247 0.157945 0.140481 0.154974 0.115165 0.124250 0.140870 0.143843 0.117478 0.116535 0.147396 0.133503 0.128576
qa: -0.0594 -0.1622 -0.1579 -0.1623 -0.2818 -0.2629 -0.4986 -0.5001 -0.4545 -0.4290 -0.0192 -0.0986 0.3264 0.0535 0.0195 0.4350 -0.3058 -0.2952 0.1205 -0.1901 0.3417 -0.1547 0.3517 -0.1835 0.3616 0.0550 -0.1814 -0.1062 0.5376 0.0736 -0.2266 -0.2456 0.1095 0.1142 0.1121 0.1130 0.1168 0.1132 0.1579 0.1405 0.1550 0.1152 0.1242 0.1409 0.1438 0.1175 0.1165 0.1474 0.1335 0.1286
va: 1.2639 1.1447 1.1539 1.1501 2.1657 2.1394 2.0118 1.9884 2.0570 2.0625 3.1134 3.3854 3.7645 3.6213 3.9559 4.2001 3.9366 3.9289 3.6284 4.1358 4.1863 3.8746 4.1745 4.1180 4.2309 3.9454 3.8684 3.9793 4.4229 3.8185 3.8515 3.9272 1.0081 1.0038 1.0175 1.0047 1.0101 1.0031 1.0205 1.0209 1.0041 1.0049 1.0124 0.9877 1.0072 1.0008 0.9986 0.9999 0.9999 1.0076
dispcorr: -0.030167743 hartree
energy: -2093.836276959573
dipole: 28.56108 -31.90984 -3.34876 11.98590 -11.72925 0.25665 12.33411 -10.05798 2.27613
magnitude: 4.05720 au
magnitude: 10.31258 debye
