program: Orca
programVersion: 5.0.2
elementType: Cl F F F O O O O O O N N C C C C C C C C C C C C C C C C C C C C H H H H H H H H H H H H H H H H H H
charge: 0
multiplicity: 1
keywords: wb97x-d3
keywords: def2-TZVPP
keywords: def2/J RIJCOSX
keywords: DEFGRID2
keywords: scfconv7
keywords: smallprint printgap noloewdin
keywords: NOSOSCF
formula: C20H18ClF3N2O6
InChI: InChI=1/C20H18ClF3N2O6/c1-5-8-31-17(29)19(2,3)32-16(28)12-9-11(6-7-13(12)21)26-15(27)10-14(20(22,23)24)25(4)18(26)30/h5-7,9-10H,1,8H2,2-4H3
50 atoms
Cl 3.391498 -3.654501 0.309534
F  -5.572333 1.781948 -1.80232
F  -6.517869 0.318723 -0.555722
F  -5.573736 2.05083 0.321162
O  3.123962 0.261396 -0.946017
O  3.051183 2.196162 0.852512
O  -2.149144 -1.152046 1.858649
O  -1.43179 -0.626773 -2.581714
O  5.281426 2.355839 0.856839
O  3.883984 -0.677257 0.93879
N  -1.802655 -0.910992 -0.362007
N  -3.803545 -0.187406 0.637541
C  4.183347 1.240654 -0.980427
C  -0.544059 -1.570419 -0.213832
C  -4.163447 0.375122 -0.561266
C  -2.561242 -0.768898 0.785381
C  3.756911 2.243978 -2.045634
C  5.509468 0.600096 -1.34761
C  1.848113 -1.445916 -0.029999
C  0.617847 -0.822469 -0.205252
C  -2.153773 -0.441803 -1.621148
C  -3.402928 0.273377 -1.661594
C  4.253764 1.96956 0.360876
C  -0.495619 -2.947815 -0.08234
C  3.070372 -0.602981 0.053642
C  1.888874 -2.829033 0.12258
C  -4.634741 -0.151028 1.845661
C  0.724703 -3.579667 0.081979
C  -5.469572 1.139606 -0.645622
C  2.941275 2.883216 2.098371
C  1.504711 3.099659 2.41992
C  0.457634 2.795552 1.664203
H  4.478611 3.05813 -2.098579
H  3.727452 1.759018 -3.021353
H  2.775072 2.66795 -1.838069
H  6.256423 1.371545 -1.526954
H  5.891818 -0.068746 -0.580048
H  5.393187 0.036872 -2.273202
H  0.565288 0.253592 -0.306756
H  -3.691305 0.711906 -2.603373
H  -1.404073 -3.534689 -0.105493
H  -4.4353 0.738855 2.437425
H  -5.686086 -0.203789 1.594179
H  -4.417064 -1.026983 2.444876
H  0.766337 -4.655357 0.17917
H  3.460609 3.844684 2.049962
H  3.419022 2.297112 2.888849
H  1.350693 3.566293 3.387112
H  -0.544594 3.011018 2.009814
H  0.539117 2.340679 0.685764
elementType: Cl F O N C H
totalener: -2093.80668320 hartree
nucrepener: 3577.29510985 hartree
electener: -5671.10179305 hartree
oneelecener: -9991.49499503 hartree
twoeener: 4320.39320198 hartree
cpcmener: -0.06011891 hartree
kineticenergy: 2086.81174500 hartree
xcener: -168.850012447882 hartree
chargesum: 0.0000000
charge: -0.057277 -0.158454 -0.161307 -0.161313 -0.281909 -0.262662 -0.495406 -0.496178 -0.454465 -0.434365 -0.048383 -0.097664 0.326511 0.052858 0.014693 0.430533 -0.292402 -0.308920 0.102849 -0.186431 0.372190 -0.158716 0.348936 -0.178081 0.394530 0.044677 -0.188965 -0.112234 0.535163 0.089633 -0.172701 -0.307882 0.113118 0.113913 0.117043 0.109113 0.112004 0.114346 0.167372 0.139509 0.157730 0.141851 0.130336 0.115252 0.143538 0.113566 0.117403 0.139138 0.133514 0.124399
qa: -0.0573 -0.1585 -0.1613 -0.1613 -0.2819 -0.2627 -0.4954 -0.4962 -0.4545 -0.4344 -0.0484 -0.0977 0.3265 0.0529 0.0147 0.4305 -0.2924 -0.3089 0.1028 -0.1864 0.3722 -0.1587 0.3489 -0.1781 0.3945 0.0447 -0.1890 -0.1122 0.5352 0.0896 -0.1727 -0.3079 0.1131 0.1139 0.1170 0.1091 0.1120 0.1143 0.1674 0.1395 0.1577 0.1419 0.1303 0.1153 0.1435 0.1136 0.1174 0.1391 0.1335 0.1244
va: 1.2651 1.1524 1.1450 1.1508 2.1663 2.1491 2.0135 2.0079 2.0586 2.0565 3.1332 3.3716 3.7763 3.6900 3.9750 4.2013 3.9289 3.9397 3.6231 4.1288 4.1808 3.8878 4.1695 4.0931 4.1865 3.9518 3.8612 3.9879 4.4214 3.8485 3.8537 3.9389 1.0052 1.0032 1.0086 1.0088 1.0170 1.0041 1.0171 1.0213 1.0023 0.9874 1.0074 1.0083 1.0081 0.9974 0.9942 1.0007 1.0039 1.0086
dispcorr: -0.028708832 hartree
energy: -2093.835392031523
dipole: 29.23689 -32.68234 -3.44546 16.10746 -15.18759 0.91986 4.72471 -4.94228 -0.21757
magnitude: 3.57276 au
magnitude: 9.08125 debye
