program: Orca
programVersion: 5.0.2
elementType: Cl F F F O O O O O O N N C C C C C C C C C C C C C C C C C C C C H H H H H H H H H H H H H H H H H H
charge: 0
multiplicity: 1
keywords: wb97x-d3
keywords: def2-TZVPP
keywords: def2/J RIJCOSX
keywords: DEFGRID2
keywords: scfconv7
keywords: smallprint printgap noloewdin
keywords: NOSOSCF
formula: C20H18ClF3N2O6
InChI: InChI=1/C20H18ClF3N2O6/c1-5-8-31-17(29)19(2,3)32-16(28)12-9-11(6-7-13(12)21)26-15(27)10-14(20(22,23)24)25(4)18(26)30/h5-7,9-10H,1,8H2,2-4H3
50 atoms
Cl 3.21975 -2.897364 0.458095
F  -6.937616 0.289744 0.170324
F  -6.134554 2.109843 -0.674116
F  -6.643161 0.466339 -1.945841
O  2.244298 1.275684 0.026017
O  4.441016 1.365748 1.50076
O  -2.253095 -0.154158 1.833266
O  -2.257727 -1.518508 -2.480226
O  5.571795 2.386051 -0.139624
O  3.648699 -0.251398 -0.803813
N  -2.248397 -0.798935 -0.331127
N  -4.069572 0.377757 0.575489
C  3.16177 2.360367 -0.217053
C  -0.923933 -1.302903 -0.156962
C  -4.722973 0.221418 -0.621445
C  -2.825449 -0.188849 0.765272
C  2.598649 3.539994 0.567623
C  3.232944 2.68797 -1.698917
C  1.450563 -0.901036 -0.138164
C  0.14511 -0.439964 -0.290286
C  -2.843615 -0.956625 -1.575452
C  -4.171778 -0.409649 -1.669074
C  4.536943 2.019572 0.358461
C  -0.719634 -2.639368 0.135447
C  2.575213 0.047906 -0.345189
C  1.649179 -2.249032 0.169064
C  -4.645718 1.027391 1.759587
C  0.570401 -3.109514 0.305197
C  -6.123467 0.778817 -0.765234
C  5.656676 0.9421 2.156014
C  6.253086 -0.243851 1.471266
C  6.208012 -1.466142 1.984562
H  2.468568 3.303604 1.623081
H  3.271597 4.392764 0.487878
H  1.63376 3.834779 0.154993
H  3.830747 3.584232 -1.85384
H  3.664658 1.887733 -2.296322
H  2.230004 2.895771 -2.071029
H  -0.040584 0.597817 -0.531697
H  -4.688592 -0.525811 -2.608033
H  -1.557876 -3.314817 0.240843
H  -3.849383 1.506012 2.317547
H  -5.341809 1.807591 1.483255
H  -5.140371 0.300573 2.400278
H  0.735045 -4.149196 0.550905
H  5.347535 0.692441 3.169078
H  6.35725 1.776937 2.206195
H  6.736512 -0.07544 0.515191
H  6.647153 -2.310495 1.469278
H  5.730923 -1.670357 2.935855
elementType: Cl F O N C H
totalener: -2093.80632987 hartree
nucrepener: 3524.63694632 hartree
electener: -5618.44327619 hartree
oneelecener: -9886.92204744 hartree
twoeener: 4268.47877125 hartree
cpcmener: -0.05986489 hartree
kineticenergy: 2086.81712587 hartree
xcener: -168.850356167468 hartree
chargesum: -0.0000000
charge: -0.055897 -0.161103 -0.162178 -0.158713 -0.293034 -0.273648 -0.496922 -0.498788 -0.461664 -0.437842 -0.044145 -0.101894 0.322440 0.025207 0.008679 0.434350 -0.291741 -0.315581 0.054829 -0.126298 0.374687 -0.152643 0.357158 -0.167710 0.437244 0.056377 -0.185065 -0.114403 0.536774 0.064736 -0.211964 -0.256610 0.116624 0.112031 0.112711 0.110555 0.115601 0.115725 0.143453 0.138419 0.156824 0.116269 0.126710 0.142194 0.141350 0.117433 0.114668 0.150944 0.138489 0.125362
qa: -0.0559 -0.1611 -0.1622 -0.1587 -0.2930 -0.2736 -0.4969 -0.4988 -0.4617 -0.4378 -0.0441 -0.1019 0.3224 0.0252 0.0087 0.4344 -0.2917 -0.3156 0.0548 -0.1263 0.3747 -0.1526 0.3572 -0.1677 0.4372 0.0564 -0.1851 -0.1144 0.5368 0.0647 -0.2120 -0.2566 0.1166 0.1120 0.1127 0.1106 0.1156 0.1157 0.1435 0.1384 0.1568 0.1163 0.1267 0.1422 0.1413 0.1174 0.1147 0.1509 0.1385 0.1254
va: 1.2655 1.1502 1.1458 1.1520 2.1533 2.1413 2.0138 2.0034 2.0462 2.0519 3.1182 3.3835 3.7793 3.6443 3.9795 4.2059 3.9246 3.9411 3.6481 4.1268 4.1818 3.8842 4.1923 4.1117 4.1426 3.9617 3.8650 3.9958 4.4207 3.8234 3.7686 3.9409 1.0130 1.0050 1.0019 1.0096 1.0135 1.0029 1.0306 1.0218 1.0028 1.0065 1.0107 0.9871 1.0102 1.0013 1.0092 1.0058 0.9995 1.0089
dispcorr: -0.028135098 hartree
energy: -2093.834464970475
dipole: 40.52905 -43.83687 -3.30782 14.72978 -13.63566 1.09412 10.98158 -9.27972 1.70186
magnitude: 3.87751 au
magnitude: 9.85586 debye
