program: Orca
programVersion: 5.0.2
elementType: Cl F F F O O O O O O N N C C C C C C C C C C C C C C C C C C C C H H H H H H H H H H H H H H H H H H
charge: 0
multiplicity: 1
keywords: wb97x-d3
keywords: def2-TZVPP
keywords: def2/J RIJCOSX
keywords: DEFGRID2
keywords: scfconv7
keywords: smallprint printgap noloewdin
keywords: NOSOSCF
formula: C20H18ClF3N2O6
InChI: InChI=1/C20H18ClF3N2O6/c1-5-8-31-17(29)19(2,3)32-16(28)12-9-11(6-7-13(12)21)26-15(27)10-14(20(22,23)24)25(4)18(26)30/h5-7,9-10H,1,8H2,2-4H3
50 atoms
Cl 3.446319 -3.326225 -0.379867
F  -6.636743 0.028741 0.307975
F  -5.796839 2.019309 0.263936
F  -6.24651 0.993029 -1.562381
O  3.840737 -0.341402 -0.236941
O  3.448429 2.275429 -0.381415
O  -2.114459 -1.283531 1.839657
O  -1.768671 -0.539623 -2.609793
O  4.870151 2.621886 1.313957
O  2.686623 0.233362 1.588414
N  -1.943526 -0.897559 -0.378384
N  -3.819887 -0.166854 0.833454
C  4.943994 0.522751 0.118735
C  -0.643697 -1.487312 -0.365305
C  -4.385606 0.234904 -0.351012
C  -2.601354 -0.814311 0.83401
C  5.796615 0.618453 -1.139979
C  5.744057 -0.065458 1.26694
C  1.712158 -1.278727 0.059367
C  0.430341 -0.740849 0.076725
C  -2.43161 -0.44168 -1.595154
C  -3.753872 0.121812 -1.529018
C  4.409645 1.919446 0.449613
C  -0.464432 -2.787256 -0.805677
C  2.798581 -0.400999 0.567899
C  1.889173 -2.583562 -0.392129
C  -4.46752 -0.034782 2.143895
C  0.805326 -3.338258 -0.813426
C  -5.780391 0.824814 -0.330868
C  2.754576 3.521729 -0.160005
C  1.735435 3.376776 0.922079
C  0.431782 3.334576 0.676956
H  5.223553 0.967266 -1.998109
H  6.621156 1.310562 -0.974076
H  6.221228 -0.356989 -1.377521
H  5.200822 -0.079585 2.209165
H  6.032832 -1.086532 1.018528
H  6.659038 0.506228 1.412898
H  0.277584 0.275205 0.420678
H  -4.200793 0.445686 -2.455007
H  -1.307598 -3.377203 -1.139194
H  -3.70141 0.062012 2.903628
H  -5.067164 0.864816 2.194291
H  -5.07927 -0.904641 2.370837
H  0.947741 -4.357161 -1.144873
H  2.279437 3.744818 -1.113304
H  3.47144 4.313703 0.060799
H  2.097974 3.309771 1.942227
H  -0.289935 3.236093 1.477454
H  0.037453 3.401123 -0.330204
elementType: Cl F O N C H
totalener: -2093.80573206 hartree
nucrepener: 3570.07757859 hartree
electener: -5663.88331066 hartree
oneelecener: -9977.57126663 hartree
twoeener: 4313.68795597 hartree
cpcmener: -0.05785616 hartree
kineticenergy: 2086.82329935 hartree
xcener: -168.849830692414 hartree
chargesum: -0.0000000
charge: -0.057155 -0.161298 -0.161563 -0.159094 -0.282062 -0.270835 -0.494239 -0.499334 -0.458490 -0.444806 -0.045905 -0.099341 0.308999 0.034722 0.014382 0.429753 -0.289570 -0.308607 0.090629 -0.157939 0.371043 -0.152336 0.354564 -0.178776 0.427471 0.047115 -0.187845 -0.111283 0.534971 0.060448 -0.214397 -0.245107 0.116549 0.110830 0.111656 0.114344 0.110296 0.112202 0.155545 0.138757 0.157425 0.115292 0.130015 0.141520 0.143913 0.117549 0.114933 0.152884 0.136874 0.125302
qa: -0.0572 -0.1613 -0.1616 -0.1591 -0.2821 -0.2708 -0.4942 -0.4993 -0.4585 -0.4448 -0.0459 -0.0993 0.3090 0.0347 0.0144 0.4298 -0.2896 -0.3086 0.0906 -0.1579 0.3710 -0.1523 0.3546 -0.1788 0.4275 0.0471 -0.1878 -0.1113 0.5350 0.0604 -0.2144 -0.2451 0.1165 0.1108 0.1117 0.1143 0.1103 0.1122 0.1555 0.1388 0.1574 0.1153 0.1300 0.1415 0.1439 0.1175 0.1149 0.1529 0.1369 0.1253
va: 1.2641 1.1501 1.1455 1.1518 2.1717 2.1411 2.0169 2.0035 2.0497 2.0564 3.1294 3.3730 3.7875 3.6959 3.9779 4.2062 3.9246 3.9378 3.6005 4.1273 4.1795 3.8868 4.1973 4.0995 4.1383 3.9514 3.8612 3.9813 4.4204 3.8247 3.7797 3.9377 1.0132 1.0050 1.0030 1.0144 1.0070 1.0082 1.0169 1.0214 1.0026 1.0091 1.0075 0.9877 1.0075 1.0013 1.0102 1.0038 1.0010 1.0083
dispcorr: -0.029046340 hartree
energy: -2093.834778402965
dipole: 36.80650 -38.94393 -2.13743 13.45040 -13.41129 0.03911 6.60738 -7.38606 -0.77868
magnitude: 2.27519 au
magnitude: 5.78308 debye
