program: Orca
programVersion: 5.0.2
elementType: Cl F F F O O O O O O N N C C C C C C C C C C C C C C C C C C C C H H H H H H H H H H H H H H H H H H
charge: 0
multiplicity: 1
keywords: wb97x-d3
keywords: def2-TZVPP
keywords: def2/J RIJCOSX
keywords: DEFGRID2
keywords: scfconv7
keywords: smallprint printgap noloewdin
keywords: NOSOSCF
formula: C20H18ClF3N2O6
InChI: InChI=1/C20H18ClF3N2O6/c1-5-8-31-17(29)19(2,3)32-16(28)12-9-11(6-7-13(12)21)26-15(27)10-14(20(22,23)24)25(4)18(26)30/h5-7,9-10H,1,8H2,2-4H3
50 atoms
Cl 3.147197 -3.319518 -1.531652
F  -6.077273 1.451031 1.211145
F  -6.682179 0.773468 -0.727129
F  -6.74344 -0.584303 0.932056
O  2.507343 0.119133 0.913299
O  5.297196 2.224478 0.544313
O  -2.011186 -1.728464 1.659635
O  -2.315369 -0.222435 -2.597879
O  3.266327 2.423287 -0.375517
O  3.744255 -0.486888 -0.849579
N  -2.163136 -0.95991 -0.460361
N  -3.883294 -0.575378 1.092565
C  3.564254 0.916527 1.477067
C  -0.872991 -1.50881 -0.728692
C  -4.62944 -0.029053 0.07862
C  -2.649553 -1.128627 0.821835
C  4.660753 0.025408 2.039672
C  2.902144 1.71799 2.59327
C  1.523314 -1.326814 -0.610434
C  0.256337 -0.807614 -0.357026
C  -2.83447 -0.338438 -1.504399
C  -4.161097 0.109326 -1.171003
C  4.021209 1.921057 0.41919
C  -0.766752 -2.739712 -1.352153
C  2.719585 -0.53642 -0.218552
C  1.62304 -2.568731 -1.238652
C  -4.338824 -0.713967 2.480639
C  0.484777 -3.271834 -1.60264
C  -6.046589 0.408927 0.379348
C  5.8253 3.289537 -0.272506
C  5.409524 4.622088 0.252817
C  4.765184 5.523618 -0.475155
H  5.352599 0.612716 2.640814
H  4.210783 -0.716819 2.699287
H  5.233054 -0.495402 1.275385
H  2.542741 1.046612 3.37318
H  3.625581 2.39715 3.04284
H  2.0627 2.306498 2.223844
H  0.148937 0.15615 0.122465
H  -4.751663 0.542887 -1.962009
H  -1.652952 -3.291567 -1.63567
H  -3.487179 -0.596899 3.141162
H  -5.041053 0.065504 2.74338
H  -4.789103 -1.689239 2.650867
H  0.572698 -4.239678 -2.075591
H  5.534083 3.152781 -1.31481
H  6.905231 3.165035 -0.201467
H  5.687002 4.843119 1.27872
H  4.511859 6.495939 -0.073583
H  4.477351 5.328552 -1.501457
elementType: Cl F O N C H
totalener: -2093.80616256 hartree
nucrepener: 3472.89255460 hartree
electener: -5566.69871716 hartree
oneelecener: -9784.04090342 hartree
twoeener: 4217.34218626 hartree
cpcmener: -0.06090799 hartree
kineticenergy: 2086.82932377 hartree
xcener: -168.851495404768 hartree
chargesum: 0.0000000
charge: -0.055671 -0.162086 -0.158578 -0.161404 -0.286586 -0.269205 -0.496932 -0.499443 -0.464676 -0.437504 -0.045083 -0.101126 0.310054 0.033176 0.011013 0.436038 -0.304911 -0.293305 0.066537 -0.147261 0.375420 -0.156343 0.355128 -0.168145 0.424938 0.056796 -0.186833 -0.113090 0.537511 0.074813 -0.201912 -0.249339 0.107347 0.113094 0.112854 0.114253 0.113311 0.118120 0.144155 0.139300 0.157855 0.115848 0.128223 0.141363 0.141658 0.111362 0.118573 0.144026 0.134451 0.122214
qa: -0.0557 -0.1621 -0.1586 -0.1614 -0.2866 -0.2692 -0.4969 -0.4994 -0.4647 -0.4375 -0.0451 -0.1011 0.3101 0.0332 0.0110 0.4360 -0.3049 -0.2933 0.0665 -0.1473 0.3754 -0.1563 0.3551 -0.1681 0.4249 0.0568 -0.1868 -0.1131 0.5375 0.0748 -0.2019 -0.2493 0.1073 0.1131 0.1129 0.1143 0.1133 0.1181 0.1442 0.1393 0.1579 0.1158 0.1282 0.1414 0.1417 0.1114 0.1186 0.1440 0.1345 0.1222
va: 1.2636 1.1455 1.1527 1.1497 2.1669 2.1689 2.0140 2.0030 2.0357 2.0547 3.1220 3.3785 3.7673 3.6466 3.9772 4.2029 3.9394 3.9257 3.6700 4.1439 4.1817 3.8859 4.1846 4.1011 4.1554 3.9596 3.8658 3.9950 4.4191 3.8427 3.8096 3.9388 1.0088 1.0032 1.0179 1.0036 1.0058 1.0111 1.0301 1.0213 1.0021 1.0053 1.0104 0.9875 1.0101 1.0087 0.9960 1.0010 1.0011 1.0074
dispcorr: -0.026637529 hartree
energy: -2093.832800090127
dipole: 43.37031 -44.80956 -1.43925 21.10155 -20.52838 0.57318 16.17917 -13.45966 2.71952
magnitude: 3.12981 au
magnitude: 7.95535 debye
