program: Orca
programVersion: 5.0.2
elementType: Cl F F F O O O O O O N N C C C C C C C C C C C C C C C C C C C C H H H H H H H H H H H H H H H H H H
charge: 0
multiplicity: 1
keywords: wb97x-d3
keywords: def2-TZVPP
keywords: def2/J RIJCOSX
keywords: DEFGRID2
keywords: scfconv7
keywords: smallprint printgap noloewdin
keywords: NOSOSCF
formula: C20H18ClF3N2O6
InChI: InChI=1/C20H18ClF3N2O6/c1-5-8-31-17(29)19(2,3)32-16(28)12-9-11(6-7-13(12)21)26-15(27)10-14(20(22,23)24)25(4)18(26)30/h5-7,9-10H,1,8H2,2-4H3
50 atoms
Cl 3.210438 -3.722225 0.204381
F  -6.170007 0.887109 -1.999613
F  -6.837079 -0.146085 -0.249786
F  -5.920667 1.800858 -0.079295
O  2.636415 0.393744 -0.837352
O  5.143012 2.380443 0.638042
O  -2.433087 -1.409145 1.849714
O  -1.70534 -0.886868 -2.585077
O  3.055349 1.984223 1.338227
O  3.778206 -0.839737 0.639648
N  -2.072686 -1.130069 -0.359887
N  -4.081592 -0.416587 0.632808
C  3.660248 1.400115 -0.917289
C  -0.791825 -1.743149 -0.205568
C  -4.506985 -0.005247 -0.606167
C  -2.843567 -1.009859 0.781519
C  3.025369 2.540567 -1.707214
C  4.888756 0.871679 -1.641908
C  1.602351 -1.530141 -0.059678
C  0.341044 -0.954535 -0.19752
C  -2.447016 -0.727651 -1.63494
C  -3.75469 -0.131568 -1.709176
C  3.914596 1.92612 0.494779
C  -0.692709 -3.119233 -0.092296
C  2.797427 -0.646022 -0.031786
C  1.692437 -2.9163 0.069968
C  -4.920917 -0.348496 1.835177
C  0.5521 -3.705133 0.045605
C  -5.873702 0.637926 -0.730717
C  5.466979 3.07796 1.858547
C  4.902562 4.45871 1.84761
C  4.091991 4.924098 2.78828
H  3.712404 3.383805 -1.76353
H  2.81119 2.214062 -2.725011
H  2.09875 2.882093 -1.246293
H  5.558329 1.692103 -1.894148
H  5.451456 0.138469 -1.068806
H  4.57697 0.4111 -2.579403
H  0.241547 0.119045 -0.282532
H  -4.090969 0.201189 -2.677689
H  -1.578844 -3.739295 -0.113348
H  -4.289884 -0.469242 2.705538
H  -5.400073 0.620048 1.922106
H  -5.664319 -1.141482 1.836374
H  0.634262 -4.779639 0.129221
H  6.555839 3.103526 1.866734
H  5.132367 2.507306 2.725896
H  5.210304 5.097693 1.025828
H  3.730904 5.943953 2.766166
H  3.768552 4.309469 3.619921
elementType: Cl F O N C H
totalener: -2093.80580812 hartree
nucrepener: 3477.08820176 hartree
electener: -5570.89400988 hartree
oneelecener: -9792.60024380 hartree
twoeener: 4221.70623391 hartree
cpcmener: -0.05936704 hartree
kineticenergy: 2086.82761456 hartree
xcener: -168.851928519171 hartree
chargesum: 0.0000000
charge: -0.055003 -0.159307 -0.161214 -0.161450 -0.287093 -0.271786 -0.494652 -0.497012 -0.462545 -0.438218 -0.052012 -0.095182 0.318345 0.054340 0.014460 0.424361 -0.294861 -0.303340 0.076916 -0.159765 0.372670 -0.152513 0.351730 -0.172369 0.417919 0.047988 -0.196023 -0.112029 0.536634 0.075774 -0.204564 -0.247791 0.112952 0.115188 0.118313 0.107086 0.112525 0.112778 0.143801 0.138686 0.158827 0.116702 0.135666 0.141565 0.141447 0.119050 0.111597 0.144567 0.134173 0.122668
qa: -0.0550 -0.1593 -0.1612 -0.1614 -0.2871 -0.2718 -0.4947 -0.4970 -0.4625 -0.4382 -0.0520 -0.0952 0.3183 0.0543 0.0145 0.4244 -0.2949 -0.3033 0.0769 -0.1598 0.3727 -0.1525 0.3517 -0.1724 0.4179 0.0480 -0.1960 -0.1120 0.5366 0.0758 -0.2046 -0.2478 0.1130 0.1152 0.1183 0.1071 0.1125 0.1128 0.1438 0.1387 0.1588 0.1167 0.1357 0.1416 0.1414 0.1190 0.1116 0.1446 0.1342 0.1227
va: 1.2648 1.1513 1.1491 1.1466 2.1640 2.1694 2.0175 2.0071 2.0359 2.0533 3.1292 3.3679 3.7559 3.6570 3.9824 4.2189 3.9257 3.9385 3.6516 4.1529 4.1815 3.8869 4.1876 4.0951 4.1655 3.9683 3.8449 3.9922 4.4151 3.8408 3.8096 3.9379 1.0063 1.0034 1.0097 1.0087 1.0180 1.0034 1.0311 1.0216 1.0017 1.0188 1.0018 0.9879 1.0101 0.9960 1.0088 1.0009 1.0011 1.0072
dispcorr: -0.026656703 hartree
energy: -2093.832464824039
dipole: 40.11160 -41.76928 -1.65768 24.31995 -22.85408 1.46587 6.15432 -6.57499 -0.42066
magnitude: 2.25248 au
magnitude: 5.72534 debye
