program: Orca
programVersion: 5.0.2
elementType: Cl F F F O O O O O O N N C C C C C C C C C C C C C C C C C C C C H H H H H H H H H H H H H H H H H H
charge: 0
multiplicity: 1
keywords: wb97x-d3
keywords: def2-TZVPP
keywords: def2/J RIJCOSX
keywords: DEFGRID2
keywords: scfconv7
keywords: smallprint printgap noloewdin
keywords: NOSOSCF
formula: C20H18ClF3N2O6
InChI: InChI=1/C20H18ClF3N2O6/c1-5-8-31-17(29)19(2,3)32-16(28)12-9-11(6-7-13(12)21)26-15(27)10-14(20(22,23)24)25(4)18(26)30/h5-7,9-10H,1,8H2,2-4H3
50 atoms
Cl 3.421002 -3.541965 0.664112
F  -6.535919 0.266573 -0.623795
F  -5.477738 2.139225 -0.409359
F  -5.646285 1.2057 -2.328409
O  3.014334 0.228358 -1.070343
O  2.867757 2.291104 0.568816
O  -2.041908 -0.580932 1.864914
O  -1.582245 -1.42547 -2.556493
O  5.100205 2.527633 0.538393
O  3.87902 -0.521627 0.85309
N  -1.830844 -1.022645 -0.340019
N  -3.756619 0.026098 0.50268
C  4.015245 1.260211 -1.205555
C  -0.56157 -1.623206 -0.081487
C  -4.183433 0.207499 -0.789474
C  -2.515017 -0.522566 0.750476
C  3.504395 2.164358 -2.321267
C  5.364332 0.669704 -1.572802
C  1.829244 -1.424915 0.048551
C  0.583275 -0.859298 -0.199575
C  -2.250639 -0.946282 -1.660701
C  -3.495569 -0.248879 -1.847096
C  4.078234 2.079196 0.085847
C  -0.484812 -2.961559 0.261158
C  3.02804 -0.548481 0.000504
C  1.900956 -2.771288 0.399305
C  -4.500882 0.467548 1.687684
C  0.75152 -3.539242 0.494833
C  -5.474415 0.962293 -1.035169
C  2.687954 3.015756 1.802188
C  2.342572 2.05533 2.889414
C  1.176997 2.07124 3.522771
H  4.181101 3.007772 -2.451837
H  3.47166 1.612547 -3.260664
H  2.508407 2.552345 -2.111292
H  6.059364 1.46701 -1.831118
H  5.808716 0.078824 -0.775232
H  5.253173 0.036893 -2.452913
H  0.504633 0.187328 -0.463153
H  -3.83577 -0.10629 -2.860061
H  -1.381499 -3.560766 0.343583
H  -4.228926 1.482362 1.970046
H  -5.569063 0.400978 1.523965
H  -4.272781 -0.199332 2.511527
H  0.816957 -4.587633 0.749768
H  1.874598 3.717392 1.62147
H  3.585911 3.585411 2.041945
H  3.105393 1.332855 3.162678
H  0.95917 1.376361 4.323117
H  0.400105 2.782867 3.268457
elementType: Cl F O N C H
totalener: -2093.80573983 hartree
nucrepener: 3571.37222369 hartree
electener: -5665.17796352 hartree
oneelecener: -9980.05210321 hartree
twoeener: 4314.87413969 hartree
cpcmener: -0.05908268 hartree
kineticenergy: 2086.81384055 hartree
xcener: -168.847051735694 hartree
chargesum: 0.0000000
charge: -0.057098 -0.161911 -0.161275 -0.158961 -0.282677 -0.269990 -0.501699 -0.499345 -0.454239 -0.434513 -0.041044 -0.097445 0.311581 0.025635 0.012940 0.438026 -0.298516 -0.309203 0.107533 -0.154839 0.375669 -0.157810 0.365416 -0.166019 0.392227 0.054724 -0.188742 -0.115153 0.537115 0.069799 -0.205121 -0.253072 0.114173 0.113177 0.117345 0.109318 0.111303 0.113926 0.139990 0.139271 0.155184 0.141886 0.129192 0.115405 0.142736 0.116435 0.109990 0.149899 0.136224 0.122549
qa: -0.0571 -0.1619 -0.1613 -0.1590 -0.2827 -0.2700 -0.5017 -0.4993 -0.4542 -0.4345 -0.0410 -0.0974 0.3116 0.0256 0.0129 0.4380 -0.2985 -0.3092 0.1075 -0.1548 0.3757 -0.1578 0.3654 -0.1660 0.3922 0.0547 -0.1887 -0.1152 0.5371 0.0698 -0.2051 -0.2531 0.1142 0.1132 0.1173 0.1093 0.1113 0.1139 0.1400 0.1393 0.1552 0.1419 0.1292 0.1154 0.1427 0.1164 0.1100 0.1499 0.1362 0.1225
va: 1.2638 1.1450 1.1501 1.1518 2.1694 2.1342 2.0028 2.0036 2.0606 2.0483 3.1117 3.3761 3.7543 3.6396 3.9768 4.1960 3.9312 3.9431 3.6197 4.1218 4.1805 3.8909 4.1899 4.1054 4.1739 3.9526 3.8640 3.9928 4.4188 3.8090 3.8061 3.9474 1.0043 1.0034 1.0092 1.0077 1.0169 1.0046 1.0333 1.0216 1.0035 0.9875 1.0084 1.0073 1.0088 1.0024 1.0200 1.0019 1.0004 1.0090
dispcorr: -0.028135425 hartree
energy: -2093.833875258020
dipole: 29.94867 -33.58199 -3.63332 16.24456 -15.23812 1.00643 7.60854 -7.86518 -0.25665
magnitude: 3.77886 au
magnitude: 9.60510 debye
