program: Orca
programVersion: 5.0.2
elementType: Cl F F F O O O O O O N N C C C C C C C C C C C C C C C C C C C C H H H H H H H H H H H H H H H H H H
charge: 0
multiplicity: 1
keywords: wb97x-d3
keywords: def2-TZVPP
keywords: def2/J RIJCOSX
keywords: DEFGRID2
keywords: scfconv7
keywords: smallprint printgap noloewdin
keywords: NOSOSCF
formula: C20H18ClF3N2O6
InChI: InChI=1/C20H18ClF3N2O6/c1-5-8-31-17(29)19(2,3)32-16(28)12-9-11(6-7-13(12)21)26-15(27)10-14(20(22,23)24)25(4)18(26)30/h5-7,9-10H,1,8H2,2-4H3
50 atoms
Cl 3.269003 -3.087871 -0.479156
F  -6.508352 1.19027 -1.235071
F  -7.132158 -0.539133 -0.139419
F  -6.352943 1.183227 0.902413
O  3.49857 -0.172623 -0.204204
O  4.771453 2.740195 1.288054
O  -2.693294 -2.347283 1.408658
O  -1.86603 0.197989 -2.236391
O  3.264947 2.553736 -0.355787
O  2.242486 0.455212 1.535906
N  -2.281158 -1.049838 -0.391267
N  -4.381144 -1.015257 0.664036
C  4.61568 0.640573 0.20368
C  -0.938314 -1.534893 -0.411817
C  -4.807714 -0.123084 -0.288536
C  -3.099981 -1.527213 0.614173
C  5.569261 0.615898 -0.985586
C  5.287074 0.054916 1.435378
C  1.397542 -1.166845 0.031612
C  0.074941 -0.737445 0.081523
C  -2.655584 -0.150095 -1.379779
C  -4.016193 0.308412 -1.281897
C  4.114059 2.078191 0.354282
C  -0.657414 -2.784656 -0.936117
C  2.420725 -0.221854 0.552973
C  1.671897 -2.434707 -0.479481
C  -5.249104 -1.54898 1.72035
C  0.648255 -3.24138 -0.952996
C  -6.216243 0.427252 -0.189135
C  4.474322 4.126687 1.469729
C  5.15928 5.015393 0.487645
C  6.047487 4.657036 -0.429107
H  5.089266 0.974843 -1.895567
H  6.434765 1.245122 -0.782468
H  5.925481 -0.400298 -1.154654
H  4.683168 0.12728 2.337067
H  5.508655 -0.996357 1.251327
H  6.234537 0.557735 1.621193
H  -0.157436 0.237428 0.490292
H  -4.354294 1.014269 -2.023423
H  -1.450376 -3.410647 -1.322927
H  -5.878962 -0.773674 2.139006
H  -5.857657 -2.369373 1.347308
H  -4.629152 -1.916584 2.528054
H  0.867576 -4.227924 -1.336319
H  4.813855 4.360223 2.479816
H  3.395167 4.294208 1.451871
H  4.882441 6.05988 0.589691
H  6.491534 5.398656 -1.079611
H  6.375742 3.635072 -0.574765
elementType: Cl F O N C H
totalener: -2093.80604177 hartree
nucrepener: 3465.48915626 hartree
electener: -5559.29519803 hartree
oneelecener: -9769.26773489 hartree
twoeener: 4209.97253687 hartree
cpcmener: -0.06079905 hartree
kineticenergy: 2086.81366713 hartree
xcener: -168.851957502521 hartree
chargesum: -0.0000000
charge: -0.058386 -0.158818 -0.161060 -0.162210 -0.280024 -0.269059 -0.496469 -0.497868 -0.454850 -0.456255 -0.047388 -0.097073 0.327116 0.038977 0.016054 0.426150 -0.298204 -0.299582 0.057064 -0.140261 0.373796 -0.153838 0.311501 -0.170810 0.450341 0.046752 -0.191133 -0.113273 0.536358 0.097958 -0.194046 -0.273623 0.121681 0.111481 0.116558 0.116263 0.109741 0.111229 0.144903 0.139280 0.158893 0.130398 0.142091 0.117140 0.143439 0.122599 0.109036 0.139367 0.133557 0.124510
qa: -0.0584 -0.1588 -0.1611 -0.1622 -0.2800 -0.2691 -0.4965 -0.4979 -0.4549 -0.4563 -0.0474 -0.0971 0.3271 0.0390 0.0161 0.4262 -0.2982 -0.2996 0.0571 -0.1403 0.3738 -0.1538 0.3115 -0.1708 0.4503 0.0468 -0.1911 -0.1133 0.5364 0.0980 -0.1940 -0.2736 0.1217 0.1115 0.1166 0.1163 0.1097 0.1112 0.1449 0.1393 0.1589 0.1304 0.1421 0.1171 0.1434 0.1226 0.1090 0.1394 0.1336 0.1245
va: 1.2600 1.1520 1.1509 1.1447 2.1758 2.1612 2.0155 2.0056 2.0398 2.0442 3.1235 3.3742 3.7915 3.6670 3.9757 4.2181 3.9196 3.9275 3.6787 4.1312 4.1820 3.8868 4.2036 4.0994 4.1130 3.9617 3.8527 3.9838 4.4191 3.8271 3.8224 3.9285 1.0120 1.0042 1.0054 1.0153 1.0062 1.0091 1.0264 1.0215 1.0022 1.0054 0.9868 1.0143 1.0082 0.9977 1.0120 1.0006 1.0023 1.0038
dispcorr: -0.027559049 hartree
energy: -2093.833600821325
dipole: 50.37024 -51.06090 -0.69066 15.58486 -15.96169 -0.37683 6.73031 -5.94342 0.78689
magnitude: 1.11275 au
magnitude: 2.82838 debye
