program: Orca
programVersion: 5.0.2
elementType: Cl F F F O O O O O O N N C C C C C C C C C C C C C C C C C C C C H H H H H H H H H H H H H H H H H H
charge: 0
multiplicity: 1
keywords: wb97x-d3
keywords: def2-TZVPP
keywords: def2/J RIJCOSX
keywords: DEFGRID2
keywords: scfconv7
keywords: smallprint printgap noloewdin
keywords: NOSOSCF
formula: C20H18ClF3N2O6
InChI: InChI=1/C20H18ClF3N2O6/c1-5-8-31-17(29)19(2,3)32-16(28)12-9-11(6-7-13(12)21)26-15(27)10-14(20(22,23)24)25(4)18(26)30/h5-7,9-10H,1,8H2,2-4H3
50 atoms
Cl 3.339958 -2.884206 -0.088432
F  -6.815844 0.103779 -1.610704
F  -6.915252 0.082014 0.528123
F  -6.188008 1.829594 -0.509244
O  2.267319 1.187216 -0.103256
O  4.572365 0.922761 1.138627
O  -2.069798 -0.244071 1.758625
O  -2.439074 -1.800433 -2.471305
O  5.609653 2.240076 -0.346646
O  3.523191 -0.176473 -1.354134
N  -2.250022 -0.983324 -0.366534
N  -4.017453 0.175418 0.661519
C  3.202608 2.277361 -0.22742
C  -0.898377 -1.437919 -0.301233
C  -4.774927 -0.051682 -0.460868
C  -2.741903 -0.343702 0.754879
C  2.753689 3.300004 0.810782
C  3.16534 2.879809 -1.620956
C  1.451559 -0.954124 -0.464639
C  0.126064 -0.533639 -0.500384
C  -2.957421 -1.22045 -1.536667
C  -4.307532 -0.721554 -1.525217
C  4.60471 1.800979 0.150291
C  -0.623385 -2.769733 -0.045062
C  2.531959 0.037396 -0.704147
C  1.722515 -2.298481 -0.210956
C  -4.513608 0.860691 1.8604
C  0.691003 -3.199307 0.00418
C  -6.187695 0.494634 -0.508955
C  5.806341 0.393458 1.622321
C  6.487973 1.283179 2.605244
C  6.035176 2.432073 3.088184
H  1.759579 3.670136 0.559326
H  2.723106 2.877665 1.814665
H  3.436074 4.148754 0.814393
H  3.734846 3.807601 -1.638608
H  3.568134 2.221676 -2.387717
H  2.135483 3.125247 -1.87965
H  -0.109462 0.502927 -0.702432
H  -4.906375 -0.895174 -2.404653
H  -1.425463 -3.47538 0.124521
H  -5.168734 1.681897 1.599599
H  -5.026704 0.167585 2.523475
H  -3.671873 1.290922 2.388973
H  0.910841 -4.235975 0.217332
H  6.475256 0.154162 0.792131
H  5.544286 -0.553043 2.097961
H  7.444051 0.896356 2.943294
H  6.617901 2.990018 3.808843
H  5.087478 2.869505 2.79849
elementType: Cl F O N C H
totalener: -2093.80699103 hartree
nucrepener: 3506.27285658 hartree
electener: -5600.07984761 hartree
oneelecener: -9849.66471678 hartree
twoeener: 4249.58486917 hartree
cpcmener: -0.06131293 hartree
kineticenergy: 2086.81598103 hartree
xcener: -168.852657879976 hartree
chargesum: -0.0000000
charge: -0.057633 -0.158819 -0.160916 -0.162437 -0.291525 -0.271811 -0.495263 -0.498841 -0.447391 -0.434882 -0.046863 -0.100306 0.356005 0.035398 0.013078 0.430080 -0.318359 -0.312463 0.061860 -0.133221 0.373033 -0.151384 0.316272 -0.167653 0.426872 0.041081 -0.189168 -0.111344 0.535672 0.092569 -0.189313 -0.275833 0.120774 0.116720 0.114563 0.111971 0.113721 0.115200 0.146624 0.138977 0.158180 0.129397 0.142408 0.116339 0.141950 0.109978 0.119260 0.137960 0.133692 0.125794
qa: -0.0576 -0.1588 -0.1609 -0.1624 -0.2915 -0.2718 -0.4953 -0.4988 -0.4474 -0.4349 -0.0469 -0.1003 0.3560 0.0354 0.0131 0.4301 -0.3184 -0.3125 0.0619 -0.1332 0.3730 -0.1514 0.3163 -0.1677 0.4269 0.0411 -0.1892 -0.1113 0.5357 0.0926 -0.1893 -0.2758 0.1208 0.1167 0.1146 0.1120 0.1137 0.1152 0.1466 0.1390 0.1582 0.1294 0.1424 0.1163 0.1419 0.1100 0.1193 0.1380 0.1337 0.1258
va: 1.2618 1.1520 1.1508 1.1449 2.1526 2.1402 2.0156 2.0038 2.0573 2.0608 3.1238 3.3771 3.7292 3.6503 3.9776 4.2112 3.9235 3.9407 3.6681 4.1113 4.1810 3.8838 4.2128 4.1039 4.1390 3.9692 3.8580 3.9945 4.4199 3.8283 3.8361 3.9326 1.0044 1.0098 1.0030 1.0077 1.0138 1.0032 1.0272 1.0214 1.0020 1.0073 0.9870 1.0113 1.0094 1.0099 0.9996 1.0010 1.0027 1.0002
dispcorr: -0.027843589 hartree
energy: -2093.834834618398
dipole: 41.32747 -44.45343 -3.12597 21.77355 -20.91150 0.86205 14.32599 -12.29285 2.03315
magnitude: 3.82733 au
magnitude: 9.72831 debye
