program: Orca
programVersion: 5.0.2
elementType: Cl F F F O O O O O O N N C C C C C C C C C C C C C C C C C C C C H H H H H H H H H H H H H H H H H H
charge: 0
multiplicity: 1
keywords: wb97x-d3
keywords: def2-TZVPP
keywords: def2/J RIJCOSX
keywords: DEFGRID2
keywords: scfconv7
keywords: smallprint printgap noloewdin
keywords: NOSOSCF
formula: C20H18ClF3N2O6
InChI: InChI=1/C20H18ClF3N2O6/c1-5-8-31-17(29)19(2,3)32-16(28)12-9-11(6-7-13(12)21)26-15(27)10-14(20(22,23)24)25(4)18(26)30/h5-7,9-10H,1,8H2,2-4H3
50 atoms
Cl 3.428824 -3.457971 -1.440539
F  -5.381115 2.352455 0.00768
F  -6.415391 0.502246 0.318455
F  -5.340993 1.437579 1.943183
O  3.060074 -0.142944 1.05648
O  2.815375 2.205573 -0.082144
O  -2.17799 -2.301806 1.374592
O  -1.34472 0.574116 -2.022428
O  5.020972 2.572108 0.033448
O  3.979138 -0.462094 -0.96103
N  -1.766399 -0.869993 -0.325178
N  -3.750392 -0.725985 0.925912
C  4.025955 0.864161 1.425155
C  -0.518109 -1.520515 -0.56469
C  -4.059748 0.426267 0.247667
C  -2.54318 -1.358393 0.706953
C  5.404275 0.265838 1.642741
C  3.491711 1.46599 2.720152
C  1.881221 -1.45699 -0.455293
C  0.645511 -0.891632 -0.165249
C  -2.075666 0.232495 -1.112954
C  -3.287986 0.910961 -0.736882
C  4.035003 1.96216 0.359481
C  -0.471318 -2.740262 -1.216341
C  3.100202 -0.660007 -0.161283
C  1.923376 -2.685866 -1.109137
C  -4.586776 -1.323588 1.971813
C  0.753706 -3.334418 -1.470938
C  -5.313111 1.184506 0.634879
C  2.61813 3.226923 -1.060318
C  1.163076 3.524123 -1.179352
C  0.187438 3.068812 -0.404033
H  6.062154 1.009518 2.08973
H  5.329785 -0.565602 2.343168
H  5.871147 -0.091604 0.728417
H  4.139651 2.278671 3.045597
H  2.481534 1.856985 2.604482
H  3.484666 0.709571 3.504958
H  0.590969 0.059808 0.346884
H  -3.535009 1.814355 -1.271321
H  -1.382317 -3.232626 -1.529409
H  -5.632888 -1.098708 1.813526
H  -4.49378 -2.402658 1.920786
H  -4.282306 -0.987145 2.960261
H  0.794545 -4.29561 -1.963693
H  3.01767 2.89214 -2.021537
H  3.159027 4.135568 -0.782054
H  0.928877 4.201251 -1.993993
H  -0.837211 3.366876 -0.582861
H  0.35155 2.3966 0.428283
elementType: Cl F O N C H
totalener: -2093.80662966 hartree
nucrepener: 3609.59766805 hartree
electener: -5703.40429771 hartree
twoeener: 4352.84355213 hartree
cpcmener: -0.06118918 hartree
kineticenergy: 2086.80809097 hartree
xcener: -168.850385691065 hartree
chargesum: 0.0000000
charge: -0.057242 -0.158412 -0.161566 -0.161339 -0.285710 -0.261073 -0.497214 -0.489842 -0.452959 -0.434046 -0.038831 -0.099326 0.325108 0.071997 0.022445 0.434060 -0.306063 -0.292936 0.117716 -0.190293 0.345735 -0.157662 0.348012 -0.189172 0.391159 0.032998 -0.184533 -0.102160 0.536696 0.087072 -0.161266 -0.323207 0.109186 0.114393 0.111311 0.114255 0.116652 0.113845 0.153672 0.140362 0.158075 0.126215 0.115095 0.141610 0.143115 0.121093 0.111123 0.138387 0.136123 0.127345
qa: -0.0572 -0.1584 -0.1616 -0.1613 -0.2857 -0.2611 -0.4972 -0.4898 -0.4530 -0.4340 -0.0388 -0.0993 0.3251 0.0720 0.0224 0.4341 -0.3061 -0.2929 0.1177 -0.1903 0.3457 -0.1577 0.3480 -0.1892 0.3912 0.0330 -0.1845 -0.1022 0.5367 0.0871 -0.1613 -0.3232 0.1092 0.1144 0.1113 0.1143 0.1167 0.1138 0.1537 0.1404 0.1581 0.1262 0.1151 0.1416 0.1431 0.1211 0.1111 0.1384 0.1361 0.1273
va: 1.2650 1.1525 1.1457 1.1503 2.1628 2.1442 2.0143 2.0052 2.0599 2.0572 3.1296 3.3802 3.7736 3.6608 3.9659 4.2025 3.9365 3.9312 3.6032 4.1467 4.1946 3.8801 4.1707 4.1032 4.1951 3.9629 3.8669 3.9722 4.4214 3.8470 3.8242 3.9383 1.0081 1.0041 1.0176 1.0053 1.0064 1.0034 1.0235 1.0213 1.0031 1.0109 1.0052 0.9874 1.0077 0.9934 1.0010 1.0025 1.0039 1.0058
dispcorr: -0.030095986 hartree
energy: -2093.836725643458
dipole: 26.65733 -30.24757 -3.59024 11.94570 -11.76329 0.18241 10.65357 -8.79811 1.85546
magnitude: 4.04547 au
magnitude: 10.28277 debye
