program: Orca
programVersion: 5.0.2
elementType: Cl F F F O O O O O O N N C C C C C C C C C C C C C C C C C C C C H H H H H H H H H H H H H H H H H H
charge: 0
multiplicity: 1
keywords: wb97x-d3
keywords: def2-TZVPP
keywords: def2/J RIJCOSX
keywords: DEFGRID2
keywords: scfconv7
keywords: smallprint printgap noloewdin
keywords: NOSOSCF
formula: C20H18ClF3N2O6
InChI: InChI=1/C20H18ClF3N2O6/c1-5-8-31-17(29)19(2,3)32-16(28)12-9-11(6-7-13(12)21)26-15(27)10-14(20(22,23)24)25(4)18(26)30/h5-7,9-10H,1,8H2,2-4H3
50 atoms
Cl 3.217867 -2.37115 -1.846472
F  -6.858199 0.855658 -0.44744
F  -6.968126 -0.788831 0.917875
F  -6.289902 1.146449 1.595126
O  2.302147 0.932437 0.679458
O  4.665872 1.551685 -0.355041
O  -2.182058 -2.01911 1.501284
O  -2.409357 0.391425 -2.321995
O  5.632273 1.458357 1.662512
O  3.537861 -0.928953 0.724347
N  -2.288908 -0.791034 -0.390098
N  -4.092812 -0.847944 1.118159
C  3.232669 1.646572 1.517864
C  -0.952692 -1.186848 -0.705616
C  -4.818833 -0.091497 0.231344
C  -2.819276 -1.271116 0.792149
C  3.138109 1.173498 2.957865
C  2.825903 3.111113 1.403634
C  1.418537 -0.950472 -0.36501
C  0.110196 -0.578319 -0.066438
C  -2.956139 0.015999 -1.303058
C  -4.310062 0.338836 -0.932924
C  4.651407 1.508668 0.963376
C  -0.733352 -2.159208 -1.666003
C  2.539704 -0.339357 0.395618
C  1.631464 -1.918895 -1.347301
C  -4.618015 -1.336388 2.397849
C  0.561712 -2.514316 -1.996919
C  -6.247073 0.280392 0.580682
C  5.934783 1.478933 -1.037222
C  6.605425 2.811815 -1.069566
C  6.786964 3.497134 -2.190721
H  3.717499 1.830518 3.604132
H  2.100431 1.224154 3.286416
H  3.497638 0.156891 3.102349
H  3.512509 3.731385 1.978261
H  2.832377 3.457874 0.370901
H  1.825271 3.252537 1.812451
H  -0.081446 0.177214 0.683626
H  -4.880919 0.936408 -1.625306
H  -1.565927 -2.637578 -2.164163
H  -3.787896 -1.506068 3.073017
H  -5.253059 -0.59453 2.867127
H  -5.161471 -2.270271 2.270749
H  0.738208 -3.255867 -2.763225
H  5.691395 1.140476 -2.042727
H  6.563492 0.722105 -0.564893
H  6.961635 3.210547 -0.125701
H  7.293083 4.453737 -2.192361
H  6.445767 3.125029 -3.149727
elementType: Cl F O N C H
totalener: -2093.80640899 hartree
nucrepener: 3479.13118889 hartree
electener: -5572.93759789 hartree
oneelecener: -9795.55101492 hartree
twoeener: 4222.61341703 hartree
cpcmener: -0.05827238 hartree
kineticenergy: 2086.79981487 hartree
xcener: -168.846083322259 hartree
chargesum: 0.0000000
charge: -0.056426 -0.158662 -0.161416 -0.161460 -0.294519 -0.274245 -0.493980 -0.496941 -0.461595 -0.437636 -0.048817 -0.099209 0.326059 0.052766 0.013218 0.428548 -0.315812 -0.291432 0.053091 -0.145574 0.370442 -0.150232 0.360323 -0.176082 0.445244 0.038323 -0.188378 -0.106740 0.534802 0.068557 -0.208515 -0.245588 0.111397 0.115963 0.114110 0.111422 0.114698 0.113670 0.146587 0.138469 0.157954 0.114817 0.131385 0.141012 0.142125 0.113873 0.111684 0.146305 0.135014 0.121398
qa: -0.0564 -0.1587 -0.1614 -0.1615 -0.2945 -0.2742 -0.4940 -0.4969 -0.4616 -0.4376 -0.0488 -0.0992 0.3261 0.0528 0.0132 0.4285 -0.3158 -0.2914 0.0531 -0.1456 0.3704 -0.1502 0.3603 -0.1761 0.4452 0.0383 -0.1884 -0.1067 0.5348 0.0686 -0.2085 -0.2456 0.1114 0.1160 0.1141 0.1114 0.1147 0.1137 0.1466 0.1385 0.1580 0.1148 0.1314 0.1410 0.1421 0.1139 0.1117 0.1463 0.1350 0.1214
va: 1.2622 1.1520 1.1496 1.1452 2.1571 2.1414 2.0171 2.0066 2.0481 2.0566 3.1320 3.3717 3.7792 3.6636 3.9788 4.2113 3.9425 3.9163 3.6707 4.1197 4.1817 3.8851 4.1882 4.1021 4.1258 3.9708 3.8570 3.9886 4.4201 3.8243 3.8233 3.9524 1.0080 1.0027 1.0133 1.0055 1.0148 1.0021 1.0288 1.0217 1.0019 1.0118 1.0056 0.9875 1.0094 1.0042 1.0098 1.0059 1.0007 1.0096
dispcorr: -0.026811780 hartree
energy: -2093.833220771222
dipole: 42.97060 -46.08662 -3.11602 18.22543 -17.34356 0.88188 8.35020 -8.05485 0.29535
magnitude: 3.25185 au
magnitude: 8.26554 debye
