program: Orca
programVersion: 5.0.2
elementType: Cl F F F O O O O O O N N C C C C C C C C C C C C C C C C C C C C H H H H H H H H H H H H H H H H H H
charge: 0
multiplicity: 1
keywords: wb97x-d3
keywords: def2-TZVPP
keywords: def2/J RIJCOSX
keywords: DEFGRID2
keywords: scfconv7
keywords: smallprint printgap noloewdin
keywords: NOSOSCF
formula: C20H18ClF3N2O6
InChI: InChI=1/C20H18ClF3N2O6/c1-5-8-31-17(29)19(2,3)32-16(28)12-9-11(6-7-13(12)21)26-15(27)10-14(20(22,23)24)25(4)18(26)30/h5-7,9-10H,1,8H2,2-4H3
50 atoms
Cl 3.152623 -2.857541 -1.789584
F  -6.80685 0.723073 -0.474155
F  -6.790393 -0.773277 1.05671
F  -6.229585 1.260023 1.517274
O  2.476468 0.18464 1.112926
O  5.230126 2.325271 0.87028
O  -2.014949 -1.815195 1.59924
O  -2.395032 0.221165 -2.423135
O  3.147648 2.68421 0.137669
O  3.685864 -0.119117 -0.74213
N  -2.202066 -0.779378 -0.398754
N  -3.932389 -0.668172 1.187575
C  3.522904 0.94208 1.7544
C  -0.899672 -1.255692 -0.739245
C  -4.708395 -0.033155 0.249849
C  -2.679007 -1.13418 0.848465
C  4.649097 0.020153 2.19411
C  2.855969 1.588394 2.962142
C  1.49336 -1.046991 -0.595269
C  0.217326 -0.592069 -0.272064
C  -2.903673 -0.057445 -1.354251
C  -4.248612 0.284908 -0.969886
C  3.940517 2.066822 0.804237
C  -0.770568 -2.386938 -1.526144
C  2.676995 -0.291698 -0.10646
C  1.615081 -2.186776 -1.391231
C  -4.378894 -0.98569 2.548122
C  0.489922 -2.854757 -1.848884
C  -6.146255 0.298508 0.595762
C  5.757965 3.358402 0.013961
C  5.862202 2.879303 -1.395119
C  5.316038 3.514505 -2.422694
H  5.220492 -0.393441 1.365855
H  5.337023 0.551706 2.849423
H  4.228544 -0.80532 2.768547
H  1.986459 2.178353 2.674136
H  2.541587 0.822166 3.670618
H  3.562719 2.244027 3.469707
H  0.094219 0.293586 0.33671
H  -4.859189 0.787933 -1.702413
H  -1.646541 -2.912307 -1.882488
H  -5.045272 -0.221378 2.925581
H  -4.863296 -1.957835 2.588908
H  -3.516824 -0.996237 3.203751
H  0.595218 -3.745688 -2.451732
H  6.745169 3.563909 0.426536
H  5.159915 4.267323 0.093322
H  6.448627 1.980285 -1.556242
H  5.447162 3.162702 -3.437525
H  4.728376 4.41517 -2.290006
elementType: Cl F O N C H
totalener: -2093.80599635 hartree
nucrepener: 3489.99628211 hartree
electener: -5583.80227846 hartree
oneelecener: -9818.53503630 hartree
twoeener: 4234.73275784 hartree
cpcmener: -0.06162676 hartree
kineticenergy: 2086.81975491 hartree
xcener: -168.849592431347 hartree
chargesum: 0.0000000
charge: -0.055743 -0.158926 -0.161337 -0.161822 -0.285146 -0.266915 -0.496034 -0.498960 -0.464774 -0.440326 -0.047538 -0.099243 0.314017 0.036064 0.013816 0.432636 -0.307030 -0.295044 0.066796 -0.148771 0.376112 -0.158571 0.349769 -0.168222 0.427564 0.057124 -0.190715 -0.113223 0.537779 0.073018 -0.200120 -0.250815 0.112473 0.108723 0.112660 0.115748 0.114067 0.115281 0.144523 0.139462 0.158142 0.131519 0.141707 0.115453 0.141676 0.119946 0.111615 0.145298 0.134350 0.121936
qa: -0.0557 -0.1589 -0.1613 -0.1618 -0.2851 -0.2669 -0.4960 -0.4990 -0.4648 -0.4403 -0.0475 -0.0992 0.3140 0.0361 0.0138 0.4326 -0.3070 -0.2950 0.0668 -0.1488 0.3761 -0.1586 0.3498 -0.1682 0.4276 0.0571 -0.1907 -0.1132 0.5378 0.0730 -0.2001 -0.2508 0.1125 0.1087 0.1127 0.1157 0.1141 0.1153 0.1445 0.1395 0.1581 0.1315 0.1417 0.1155 0.1417 0.1199 0.1116 0.1453 0.1343 0.1219
va: 1.2636 1.1516 1.1492 1.1455 2.1706 2.1696 2.0147 2.0039 2.0362 2.0486 3.1232 3.3701 3.7624 3.6519 3.9770 4.2087 3.9404 3.9275 3.6653 4.1417 4.1815 3.8885 4.1913 4.1006 4.1525 3.9588 3.8606 3.9941 4.4168 3.8376 3.8037 3.9420 1.0174 1.0081 1.0036 1.0119 1.0030 1.0047 1.0294 1.0214 1.0017 1.0071 0.9877 1.0085 1.0101 0.9959 1.0081 1.0012 1.0012 1.0071
dispcorr: -0.026967526 hartree
energy: -2093.832963875280
dipole: 44.87111 -46.23758 -1.36647 15.28340 -15.28966 -0.00626 12.66810 -10.09621 2.57189
magnitude: 2.91237 au
magnitude: 7.40265 debye
