program: Orca
programVersion: 5.0.2
elementType: Cl F F F O O O O O O N N C C C C C C C C C C C C C C C C C C C C H H H H H H H H H H H H H H H H H H
charge: 0
multiplicity: 1
keywords: wb97x-d3
keywords: def2-TZVPP
keywords: def2/J RIJCOSX
keywords: DEFGRID2
keywords: scfconv7
keywords: smallprint printgap noloewdin
keywords: NOSOSCF
formula: C20H18ClF3N2O6
InChI: InChI=1/C20H18ClF3N2O6/c1-5-8-31-17(29)19(2,3)32-16(28)12-9-11(6-7-13(12)21)26-15(27)10-14(20(22,23)24)25(4)18(26)30/h5-7,9-10H,1,8H2,2-4H3
50 atoms
Cl 3.205169 -2.830651 0.771084
F  -6.373663 0.813164 -2.309649
F  -7.069932 -0.395803 -0.684974
F  -6.423168 1.633316 -0.331748
O  2.291393 1.306776 -0.155843
O  4.399028 1.629395 1.441635
O  -2.55414 -0.565754 1.852344
O  -1.87778 -0.985525 -2.603466
O  5.660229 2.242355 -0.303856
O  3.711442 -0.334187 -0.672677
N  -2.226258 -0.79608 -0.371549
N  -4.319786 -0.155162 0.485837
C  3.255661 2.323408 -0.500444
C  -0.903534 -1.265744 -0.109602
C  -4.755834 0.030907 -0.801823
C  -3.007526 -0.503572 0.730057
C  2.68671 3.618927 0.065497
C  3.421457 2.425639 -2.006294
C  1.473701 -0.8751 -0.055084
C  0.174832 -0.421534 -0.281955
C  -2.63155 -0.692176 -1.695622
C  -3.977924 -0.211219 -1.867996
C  4.584768 2.035954 0.20048
C  -0.715102 -2.573245 0.303994
C  2.617292 0.033682 -0.326198
C  1.652737 -2.191411 0.379646
C  -5.137504 0.070238 1.683152
C  0.563782 -3.030101 0.561331
C  -6.169712 0.526702 -1.03012
C  5.549554 1.290046 2.244377
C  6.042039 -0.080789 1.919201
C  5.92288 -1.102126 2.757367
H  3.393967 4.43235 -0.091584
H  1.761762 3.875792 -0.451023
H  2.480898 3.544758 1.132468
H  4.015177 3.30406 -2.25446
H  3.90414 1.557064 -2.448699
H  2.443001 2.552325 -2.468945
H  0.004313 0.594086 -0.611815
H  -4.325105 -0.066261 -2.878372
H  -1.558997 -3.237559 0.434354
H  -6.186525 -0.097742 1.479597
H  -4.851622 -0.649147 2.442135
H  -4.993262 1.075362 2.072836
H  0.712258 -4.04466 0.903312
H  5.19432 1.341828 3.271867
H  6.328453 2.042868 2.112953
H  6.518604 -0.223822 0.955122
H  6.296916 -2.085814 2.505885
H  5.452999 -0.992578 3.727897
elementType: Cl F O N C H
totalener: -2093.80622114 hartree
nucrepener: 3515.39770026 hartree
electener: -5609.20392140 hartree
oneelecener: -9868.53580360 hartree
twoeener: 4259.33188220 hartree
cpcmener: -0.05961071 hartree
kineticenergy: 2086.80955725 hartree
xcener: -168.849227569411 hartree
chargesum: -0.0000000
charge: -0.055049 -0.158298 -0.161611 -0.161717 -0.294290 -0.272823 -0.496358 -0.497553 -0.462313 -0.438056 -0.048899 -0.099152 0.323850 0.048585 0.013049 0.434166 -0.295274 -0.317904 0.052056 -0.147741 0.373830 -0.158856 0.359014 -0.170680 0.447884 0.048223 -0.180481 -0.111704 0.535749 0.067583 -0.215873 -0.248795 0.112865 0.113074 0.115687 0.111787 0.114399 0.115862 0.146451 0.139078 0.159470 0.123463 0.115443 0.141024 0.141827 0.117201 0.112086 0.150645 0.135161 0.123918
qa: -0.0550 -0.1583 -0.1616 -0.1617 -0.2943 -0.2728 -0.4964 -0.4976 -0.4623 -0.4381 -0.0489 -0.0992 0.3238 0.0486 0.0130 0.4342 -0.2953 -0.3179 0.0521 -0.1477 0.3738 -0.1589 0.3590 -0.1707 0.4479 0.0482 -0.1805 -0.1117 0.5357 0.0676 -0.2159 -0.2488 0.1129 0.1131 0.1157 0.1118 0.1144 0.1159 0.1465 0.1391 0.1595 0.1235 0.1154 0.1410 0.1418 0.1172 0.1121 0.1506 0.1352 0.1239
va: 1.2651 1.1527 1.1451 1.1505 2.1574 2.1438 2.0140 2.0070 2.0455 2.0505 3.1312 3.3802 3.7769 3.6603 3.9752 4.2038 3.9237 3.9416 3.6511 4.1321 4.1819 3.8868 4.1916 4.1043 4.1296 3.9709 3.8674 3.9949 4.4241 3.8222 3.7815 3.9450 1.0044 1.0017 1.0136 1.0072 1.0138 1.0033 1.0305 1.0216 1.0012 1.0117 1.0052 0.9877 1.0101 1.0020 1.0106 1.0055 1.0011 1.0085
dispcorr: -0.027944799 hartree
energy: -2093.834165939010
dipole: 39.58771 -43.21308 -3.62537 14.50331 -13.73806 0.76525 11.41168 -9.82558 1.58609
magnitude: 4.03046 au
magnitude: 10.24461 debye
