program: Orca
programVersion: 5.0.2
elementType: Cl F F F O O O O O O N N C C C C C C C C C C C C C C C C C C C C H H H H H H H H H H H H H H H H H H
charge: 0
multiplicity: 1
keywords: wb97x-d3
keywords: def2-TZVPP
keywords: def2/J RIJCOSX
keywords: DEFGRID2
keywords: scfconv7
keywords: smallprint printgap noloewdin
keywords: NOSOSCF
formula: C20H18ClF3N2O6
InChI: InChI=1/C20H18ClF3N2O6/c1-5-8-31-17(29)19(2,3)32-16(28)12-9-11(6-7-13(12)21)26-15(27)10-14(20(22,23)24)25(4)18(26)30/h5-7,9-10H,1,8H2,2-4H3
50 atoms
Cl 3.2545 -2.200326 0.616839
F  -7.248935 -1.081349 -0.715531
F  -6.965315 0.931427 0.014446
F  -6.725976 0.49625 -2.06796
O  3.261554 0.341559 -0.858038
O  4.722425 1.134604 1.209038
O  -2.818058 -0.997991 1.977447
O  -2.017967 -0.564344 -2.456803
O  5.15093 3.10399 0.236387
O  2.009029 1.797577 0.288419
N  -2.427504 -0.805638 -0.239012
N  -4.604733 -0.608276 0.625602
C  4.308287 1.298104 -1.114246
C  -1.053474 -1.121708 -0.0170
C  -5.040228 -0.278735 -0.63388
C  -3.260499 -0.812113 0.864333
C  3.870607 2.31428 -2.154375
C  5.478779 0.468755 -1.633184
C  1.251896 -0.435983 0.029727
C  -0.098163 -0.128829 -0.107419
C  -2.820706 -0.536976 -1.543949
C  -4.218069 -0.230326 -1.692344
C  4.748869 1.969942 0.185538
C  -0.683754 -2.429749 0.245651
C  2.210148 0.688387 -0.143813
C  1.615476 -1.750904 0.319899
C  -5.483117 -0.682639 1.79888
C  0.650517 -2.739663 0.434915
C  -6.510255 0.022309 -0.846866
C  5.152379 1.611642 2.484737
C  6.631879 1.572948 2.661976
C  7.522002 1.070807 1.817038
H  4.719511 2.925201 -2.456656
H  3.513965 1.790659 -3.040963
H  3.083711 2.978458 -1.803413
H  5.763521 -0.31646 -0.933831
H  5.212471 0.007321 -2.584202
H  6.342319 1.110228 -1.802631
H  -0.396299 0.891591 -0.310406
H  -4.565873 0.024839 -2.680214
H  -1.429437 -3.211185 0.309186
H  -6.444095 -1.109607 1.537911
H  -5.035659 -1.347829 2.527404
H  -5.616869 0.29622 2.253813
H  0.938231 -3.755452 0.666587
H  4.674318 0.953765 3.212292
H  4.769507 2.617888 2.66966
H  6.963492 1.995553 3.60501
H  8.576198 1.08842 2.058584
H  7.25698 0.627202 0.86509
elementType: Cl F O N C H
totalener: -2093.80578379 hartree
nucrepener: 3485.99475234 hartree
electener: -5579.80053613 hartree
oneelecener: -9809.52531527 hartree
twoeener: 4229.72477914 hartree
cpcmener: -0.05840853 hartree
kineticenergy: 2086.81325767 hartree
xcener: -168.852334911850 hartree
chargesum: -0.0000000
charge: -0.060288 -0.161529 -0.161354 -0.159166 -0.279253 -0.269438 -0.494808 -0.496559 -0.448662 -0.456422 -0.051695 -0.097499 0.347672 0.051315 0.016885 0.427327 -0.309281 -0.323424 0.052587 -0.139980 0.369764 -0.153361 0.322557 -0.170945 0.456470 0.030929 -0.190039 -0.114385 0.536031 0.091602 -0.188949 -0.276265 0.109277 0.115110 0.113300 0.112946 0.121563 0.119865 0.147832 0.138380 0.160267 0.130977 0.115336 0.142114 0.143505 0.120518 0.110194 0.138371 0.133727 0.126878
qa: -0.0603 -0.1615 -0.1614 -0.1592 -0.2793 -0.2694 -0.4948 -0.4966 -0.4487 -0.4564 -0.0517 -0.0975 0.3477 0.0513 0.0169 0.4273 -0.3093 -0.3234 0.0526 -0.1400 0.3698 -0.1534 0.3226 -0.1709 0.4565 0.0309 -0.1900 -0.1144 0.5360 0.0916 -0.1889 -0.2763 0.1093 0.1151 0.1133 0.1129 0.1216 0.1199 0.1478 0.1384 0.1603 0.1310 0.1153 0.1421 0.1435 0.1205 0.1102 0.1384 0.1337 0.1269
va: 1.2590 1.1448 1.1506 1.1514 2.1722 2.1384 2.0166 2.0079 2.0564 2.0404 3.1392 3.3717 3.7387 3.6856 3.9772 4.2132 3.9436 3.9336 3.6724 4.0968 4.1807 3.8885 4.1970 4.0930 4.0960 3.9704 3.8567 3.9914 4.4185 3.8292 3.8242 3.9322 1.0090 1.0043 1.0143 1.0072 1.0052 1.0037 1.0248 1.0221 1.0010 1.0058 1.0116 0.9873 1.0082 0.9980 1.0115 1.0010 1.0028 0.9998
dispcorr: -0.028163376 hartree
energy: -2093.833947169291
dipole: 51.26548 -53.14984 -1.88436 10.01516 -11.73388 -1.71872 5.67731 -5.22292 0.45439
magnitude: 2.59062 au
magnitude: 6.58483 debye
