program: Orca
programVersion: 5.0.2
elementType: Cl F F F O O O O O O N N C C C C C C C C C C C C C C C C C C C C H H H H H H H H H H H H H H H H H H
charge: 0
multiplicity: 1
keywords: wb97x-d3
keywords: def2-TZVPP
keywords: def2/J RIJCOSX
keywords: DEFGRID2
keywords: scfconv7
keywords: smallprint printgap noloewdin
keywords: NOSOSCF
formula: C20H18ClF3N2O6
InChI: InChI=1/C20H18ClF3N2O6/c1-5-8-31-17(29)19(2,3)32-16(28)12-9-11(6-7-13(12)21)26-15(27)10-14(20(22,23)24)25(4)18(26)30/h5-7,9-10H,1,8H2,2-4H3
50 atoms
Cl 3.442322 -3.280117 -0.120102
F  -6.550111 0.456412 0.538519
F  -5.801468 2.078961 -0.672969
F  -6.505111 0.282642 -1.595676
O  3.898788 -0.403387 0.040774
O  3.409692 1.958739 1.059949
O  -1.654665 0.136492 1.64833
O  -2.285968 -1.977551 -2.302559
O  4.863412 2.948944 -0.322725
O  2.705001 0.731158 -1.466015
N  -1.965071 -0.893207 -0.336518
N  -3.634573 0.486134 0.581061
C  4.976305 0.557078 -0.002963
C  -0.651327 -1.445262 -0.243588
C  -4.443128 0.159125 -0.480294
C  -2.37723 -0.072264 0.69706
C  5.769247 0.440153 -1.292387
C  5.855563 0.222477 1.196409
C  1.734866 -1.169999 -0.446819
C  0.443519 -0.652839 -0.52269
C  -2.729108 -1.24027 -1.442975
C  -4.045852 -0.661952 -1.463445
C  4.404698 1.962391 0.195825
C  -0.482936 -2.777659 0.092987
C  2.830486 -0.197194 -0.702673
C  1.894346 -2.519498 -0.131122
C  -4.068168 1.347573 1.688795
C  0.790503 -3.316811 0.131774
C  -5.837916 0.751585 -0.548411
C  2.658918 3.169076 1.272771
C  1.388383 2.773502 1.942655
C  0.993494 3.261484 3.110786
H  5.202556 0.722832 -2.176978
H  6.654253 1.073267 -1.240651
H  6.111802 -0.587464 -1.412204
H  6.286713 -0.77106 1.074473
H  6.675399 0.936716 1.262037
H  5.300701 0.250092 2.133276
H  0.29863 0.386275 -0.788158
H  -4.682356 -0.912529 -2.296551
H  -1.335569 -3.405121 0.315871
H  -4.697729 0.801212 2.387189
H  -3.192423 1.70095 2.217854
H  -4.587217 2.223822 1.318542
H  0.921137 -4.363617 0.366791
H  2.454087 3.641479 0.308933
H  3.238986 3.863741 1.882782
H  0.758519 2.06835 1.407182
H  0.047426 2.973864 3.550245
H  1.598882 3.965568 3.669684
elementType: Cl F O N C H
totalener: -2093.80547012 hartree
nucrepener: 3558.53722191 hartree
electener: -5652.34269203 hartree
oneelecener: -9954.17265901 hartree
twoeener: 4301.82996698 hartree
cpcmener: -0.05622527 hartree
kineticenergy: 2086.79897554 hartree
xcener: -168.846056321743 hartree
chargesum: 0.0000000
charge: -0.056788 -0.161027 -0.161817 -0.159405 -0.280677 -0.268003 -0.497996 -0.497167 -0.458556 -0.457919 -0.048494 -0.093801 0.309476 0.064664 0.013919 0.425269 -0.308678 -0.287922 0.077393 -0.161899 0.369005 -0.148788 0.355409 -0.181134 0.449916 0.032905 -0.199261 -0.104752 0.537544 0.072723 -0.220873 -0.241386 0.114920 0.109841 0.112104 0.111265 0.111226 0.116327 0.147954 0.138781 0.159675 0.141773 0.117395 0.136629 0.142235 0.113989 0.117196 0.142196 0.133033 0.121582
qa: -0.0568 -0.1610 -0.1618 -0.1594 -0.2807 -0.2680 -0.4980 -0.4972 -0.4586 -0.4579 -0.0485 -0.0938 0.3095 0.0647 0.0139 0.4253 -0.3087 -0.2879 0.0774 -0.1619 0.3690 -0.1488 0.3554 -0.1811 0.4499 0.0329 -0.1993 -0.1048 0.5375 0.0727 -0.2209 -0.2414 0.1149 0.1098 0.1121 0.1113 0.1112 0.1163 0.1480 0.1388 0.1597 0.1418 0.1174 0.1366 0.1422 0.1140 0.1172 0.1422 0.1330 0.1216
va: 1.2596 1.1490 1.1466 1.1510 2.1735 2.1386 2.0083 2.0067 2.0527 2.0419 3.1312 3.3668 3.8070 3.6592 3.9811 4.2100 3.9351 3.9206 3.6572 4.1016 4.1814 3.8840 4.1867 4.1124 4.1024 3.9778 3.8536 3.9763 4.4130 3.8263 3.8716 3.9448 1.0146 1.0091 1.0052 1.0033 1.0057 1.0131 1.0260 1.0215 1.0006 0.9882 1.0133 1.0023 1.0084 0.9990 1.0019 0.9972 1.0027 1.0086
dispcorr: -0.028619457 hartree
energy: -2093.834089575145
dipole: 38.44548 -40.46418 -2.01870 15.30050 -15.36409 -0.06359 14.98176 -12.79878 2.18298
magnitude: 2.97398 au
magnitude: 7.55926 debye
