program: Orca
programVersion: 5.0.2
elementType: Cl F F F O O O O O O N N C C C C C C C C C C C C C C C C C C C C H H H H H H H H H H H H H H H H H H
charge: 0
multiplicity: 1
keywords: wb97x-d3
keywords: def2-TZVPP
keywords: def2/J RIJCOSX
keywords: DEFGRID2
keywords: scfconv7
keywords: smallprint printgap noloewdin
keywords: NOSOSCF
formula: C20H18ClF3N2O6
InChI: InChI=1/C20H18ClF3N2O6/c1-5-8-31-17(29)19(2,3)32-16(28)12-9-11(6-7-13(12)21)26-15(27)10-14(20(22,23)24)25(4)18(26)30/h5-7,9-10H,1,8H2,2-4H3
50 atoms
Cl 3.456695 -3.323944 -0.725834
F  -6.655801 -0.063435 0.077755
F  -5.815445 1.625495 1.125442
F  -6.016478 1.669316 -1.005866
O  3.695726 -0.415024 0.58322
O  3.122913 2.125005 1.055629
O  -2.059511 -1.626755 1.728067
O  -1.64038 0.133281 -2.421277
O  4.975546 2.770799 -0.031404
O  3.183968 0.483594 -1.40153
N  -1.882437 -0.809177 -0.369765
N  -3.843047 -0.490556 0.891598
C  4.801626 0.497451 0.782021
C  -0.593988 -1.417378 -0.469301
C  -4.334044 0.287577 -0.127462
C  -2.567649 -1.012836 0.815133
C  5.979073 0.123498 -0.098699
C  5.16619 0.363856 2.254812
C  1.792594 -1.210582 -0.51135
C  0.536956 -0.624096 -0.440305
C  -2.325925 -0.027647 -1.43026
C  -3.63694 0.538193 -1.24544
C  4.316253 1.929193 0.523533
C  -0.486321 -2.792723 -0.599125
C  2.972254 -0.303114 -0.513325
C  1.898203 -2.589946 -0.616003
C  -4.57819 -0.74125 2.136786
C  0.763809 -3.383666 -0.670421
C  -5.718776 0.884762 0.021977
C  2.418868 3.362555 0.815877
C  1.611272 3.249207 -0.435948
C  0.292503 3.09603 -0.430885
H  6.250537 -0.91615 0.083485
H  5.7800 0.248122 -1.160797
H  6.842313 0.735325 0.158445
H  4.315423 0.555106 2.907375
H  5.540157 -0.640102 2.455859
H  5.955979 1.071093 2.504857
H  0.45059 0.451367 -0.343848
H  -4.026353 1.149934 -2.04331
H  -1.372379 -3.411641 -0.644352
H  -4.112286 -1.570014 2.653555
H  -4.555395 0.126803 2.790324
H  -5.601466 -1.032381 1.929217
H  0.849879 -4.456436 -0.772172
H  3.12073 4.195805 0.776214
H  1.777375 3.494607 1.685215
H  2.152937 3.278688 -1.375598
H  -0.27087 2.997677 -1.350136
H  -0.273339 3.063627 0.493192
elementType: Cl F O N C H
totalener: -2093.80408143 hartree
nucrepener: 3589.71449932 hartree
electener: -5683.51858075 hartree
twoeener: 4333.19250941 hartree
cpcmener: -0.05782629 hartree
kineticenergy: 2086.81816934 hartree
xcener: -168.849352386540 hartree
chargesum: 0.0000000
charge: -0.058973 -0.161925 -0.161272 -0.158798 -0.273351 -0.267663 -0.493583 -0.495177 -0.454252 -0.431365 -0.046063 -0.092743 0.301891 0.057351 0.016488 0.421140 -0.310357 -0.292597 0.082707 -0.147267 0.365197 -0.154823 0.358975 -0.171319 0.380723 0.069355 -0.199430 -0.128651 0.537963 0.050017 -0.196718 -0.249831 0.110303 0.114640 0.112290 0.115455 0.112350 0.110465 0.135820 0.139956 0.159607 0.114513 0.142272 0.137744 0.145690 0.115243 0.117233 0.152662 0.140504 0.127605
qa: -0.0590 -0.1619 -0.1613 -0.1588 -0.2734 -0.2677 -0.4936 -0.4952 -0.4543 -0.4314 -0.0461 -0.0927 0.3019 0.0574 0.0165 0.4211 -0.3104 -0.2926 0.0827 -0.1473 0.3652 -0.1548 0.3590 -0.1713 0.3807 0.0694 -0.1994 -0.1287 0.5380 0.0500 -0.1967 -0.2498 0.1103 0.1146 0.1123 0.1155 0.1124 0.1105 0.1358 0.1400 0.1596 0.1145 0.1423 0.1377 0.1457 0.1152 0.1172 0.1527 0.1405 0.1276
va: 1.2677 1.1467 1.1481 1.1522 2.1697 2.1440 2.0183 2.0034 2.0550 2.0664 3.1519 3.3636 3.7797 3.7258 3.9771 4.2159 3.9387 3.9251 3.6406 4.0991 4.1690 3.8859 4.1956 4.0468 4.1778 3.9135 3.8452 3.9985 4.4132 3.8363 3.7772 3.9263 1.0069 1.0144 1.0088 1.0137 1.0028 1.0042 1.0296 1.0212 1.0007 1.0190 0.9886 1.0011 1.0058 1.0137 1.0013 1.0032 1.0046 1.0094
dispcorr: -0.030065017 hartree
energy: -2093.834146449759
dipole: 34.19089 -36.95878 -2.76789 10.46413 -11.09544 -0.63131 11.26302 -8.82788 2.43514
magnitude: 3.74028 au
magnitude: 9.50703 debye
