program: Orca
programVersion: 5.0.2
elementType: Cl F F F O O O O O O N N C C C C C C C C C C C C C C C C C C C C H H H H H H H H H H H H H H H H H H
charge: 0
multiplicity: 1
keywords: wb97x-d3
keywords: def2-TZVPP
keywords: def2/J RIJCOSX
keywords: DEFGRID2
keywords: scfconv7
keywords: smallprint printgap noloewdin
keywords: NOSOSCF
formula: C20H18ClF3N2O6
InChI: InChI=1/C20H18ClF3N2O6/c1-5-8-31-17(29)19(2,3)32-16(28)12-9-11(6-7-13(12)21)26-15(27)10-14(20(22,23)24)25(4)18(26)30/h5-7,9-10H,1,8H2,2-4H3
50 atoms
Cl 3.212551 -1.80074 -1.661283
F  -7.083727 -1.167069 0.944784
F  -6.68137 0.896061 1.443391
F  -7.185279 0.345488 -0.565767
O  3.314859 -0.226227 0.74982
O  4.586407 1.675027 -0.598893
O  -2.238927 -1.802807 1.589986
O  -2.68621 0.309265 -2.387749
O  5.049074 2.786434 1.288566
O  1.964537 1.551722 0.710655
N  -2.45788 -0.719673 -0.379988
N  -4.246087 -0.8409 1.139457
C  4.371324 0.479059 1.429336
C  -1.083995 -0.986966 -0.657902
C  -5.047588 -0.252775 0.193546
C  -2.941192 -1.166532 0.834691
C  5.591941 -0.425513 1.297291
C  4.0209 0.700619 2.890299
C  1.240968 -0.466009 -0.300718
C  -0.107547 -0.218193 -0.058234
C  -3.199363 -0.053059 -1.346485
C  -4.583885 0.138631 -1.003117
C  4.68351 1.792948 0.714339
C  -0.73904 -2.002652 -1.53237
C  2.205437 0.402936 0.424847
C  1.581374 -1.477863 -1.20142
C  -4.703477 -1.252988 2.471364
C  0.594442 -2.236056 -1.814056
C  -6.513929 -0.043625 0.510602
C  4.907204 2.8067 -1.40828
C  6.367259 2.941226 -1.677308
C  7.323578 2.097255 -1.3154
H  6.458855 0.051875 1.752024
H  5.413268 -1.365196 1.820646
H  5.824683 -0.646697 0.256253
H  4.891487 1.069986 3.430142
H  3.207455 1.408807 3.033889
H  3.737878 -0.250436 3.341139
H  -0.391132 0.574812 0.621359
H  -5.217262 0.604523 -1.740844
H  -1.50121 -2.609493 -2.002635
H  -5.470888 -0.587283 2.843714
H  -5.069813 -2.276654 2.463774
H  -3.871659 -1.183083 3.162298
H  0.865377 -3.011802 -2.516149
H  4.511986 3.723717 -0.965804
H  4.370004 2.651483 -2.345238
H  6.619746 3.828427 -2.249122
H  8.354511 2.293641 -1.577003
H  7.138014 1.191478 -0.751428
elementType: Cl F O N C H
totalener: -2093.80601098 hartree
nucrepener: 3489.10485665 hartree
electener: -5582.91086764 hartree
oneelecener: -9815.67073009 hartree
twoeener: 4232.75986246 hartree
cpcmener: -0.05846132 hartree
kineticenergy: 2086.82404217 hartree
xcener: -168.854820456986 hartree
chargesum: 0.0000000
charge: -0.057944 -0.161359 -0.161814 -0.158575 -0.279701 -0.272313 -0.494958 -0.498569 -0.448198 -0.460991 -0.049745 -0.099423 0.347977 0.040451 0.014603 0.431982 -0.325580 -0.310420 0.044740 -0.115791 0.372564 -0.157793 0.326338 -0.176835 0.459123 0.028349 -0.186286 -0.106238 0.536189 0.092006 -0.189921 -0.275833 0.121067 0.121639 0.112967 0.109832 0.113089 0.114622 0.144329 0.139496 0.159322 0.128668 0.141043 0.115617 0.142088 0.109011 0.121496 0.138551 0.133818 0.127310
qa: -0.0579 -0.1614 -0.1618 -0.1586 -0.2797 -0.2723 -0.4950 -0.4986 -0.4482 -0.4610 -0.0497 -0.0994 0.3480 0.0405 0.0146 0.4320 -0.3256 -0.3104 0.0447 -0.1158 0.3726 -0.1578 0.3263 -0.1768 0.4591 0.0283 -0.1863 -0.1062 0.5362 0.0920 -0.1899 -0.2758 0.1211 0.1216 0.1130 0.1098 0.1131 0.1146 0.1443 0.1395 0.1593 0.1287 0.1410 0.1156 0.1421 0.1090 0.1215 0.1386 0.1338 0.1273
va: 1.2587 1.1501 1.1449 1.1525 2.1752 2.1364 2.0160 2.0054 2.0577 2.0361 3.1308 3.3735 3.7369 3.6760 3.9745 4.2070 3.9308 3.9420 3.6790 4.0926 4.1825 3.8871 4.1934 4.1083 4.0987 3.9763 3.8625 3.9826 4.4206 3.8318 3.8241 3.9315 1.0037 1.0054 1.0065 1.0083 1.0144 1.0046 1.0290 1.0213 1.0014 1.0085 0.9878 1.0075 1.0090 1.0117 0.9972 1.0010 1.0029 0.9988
dispcorr: -0.028049231 hartree
energy: -2093.834060214680
dipole: 52.89387 -54.40538 -1.51151 7.55321 -9.20751 -1.65430 8.66530 -8.30732 0.35798
magnitude: 2.26926 au
magnitude: 5.76799 debye
