program: Orca
programVersion: 5.0.2
elementType: Cl F F F O O O O O O N N C C C C C C C C C C C C C C C C C C C C H H H H H H H H H H H H H H H H H H
charge: 0
multiplicity: 1
keywords: wb97x-d3
keywords: def2-TZVPP
keywords: def2/J RIJCOSX
keywords: DEFGRID2
keywords: scfconv7
keywords: smallprint printgap noloewdin
keywords: NOSOSCF
formula: C20H18ClF3N2O6
InChI: InChI=1/C20H18ClF3N2O6/c1-5-8-31-17(29)19(2,3)32-16(28)12-9-11(6-7-13(12)21)26-15(27)10-14(20(22,23)24)25(4)18(26)30/h5-7,9-10H,1,8H2,2-4H3
50 atoms
Cl 3.363103 -1.792907 -1.653758
F  -6.597007 0.777164 1.498717
F  -6.94609 0.715682 -0.612413
F  -6.999869 -1.102296 0.512653
O  3.539807 -0.372606 0.828422
O  4.835749 1.759817 -0.176164
O  -2.202494 -1.990509 1.407357
O  -2.339355 0.834408 -2.122846
O  5.149367 2.561819 1.884992
O  2.192144 1.393583 1.035076
N  -2.275137 -0.569933 -0.344884
N  -4.169249 -0.924203 1.001203
C  4.587533 0.232353 1.612569
C  -0.906044 -0.868554 -0.62178
C  -4.88737 -0.125899 0.145199
C  -2.84652 -1.214988 0.734285
C  5.83146 -0.600776 1.324727
C  4.237847 0.185328 3.088622
C  1.436345 -0.481691 -0.198909
C  0.094325 -0.204184 0.056758
C  -2.930421 0.303664 -1.202284
C  -4.327407 0.487501 -0.908402
C  4.858506 1.661001 1.139248
C  -0.592097 -1.809215 -1.587713
C  2.422241 0.28659 0.608246
C  1.744158 -1.423181 -1.184097
C  -4.73864 -1.596454 2.175178
C  0.733349 -2.076001 -1.874735
C  -6.371192 0.066342 0.392472
C  5.112546 3.03537 -0.755469
C  5.034419 2.941662 -2.237848
C  4.739721 1.870707 -2.962469
H  5.686094 -1.621452 1.678355
H  6.066946 -0.6311 0.26168
H  6.686454 -0.182269 1.854383
H  5.081774 0.532183 3.683777
H  3.370987 0.793659 3.342083
H  4.036225 -0.846178 3.378527
H  -0.165114 0.530859 0.806961
H  -4.893936 1.119634 -1.573039
H  -1.372939 -2.330713 -2.124813
H  -5.512684 -0.993125 2.633979
H  -5.133356 -2.576831 1.914485
H  -3.958861 -1.718372 2.919035
H  0.980433 -2.794375 -2.64354
H  6.107833 3.376701 -0.456764
H  4.395186 3.776592 -0.390805
H  5.251488 3.881923 -2.734059
H  4.713305 1.934593 -4.0421
H  4.508812 0.905121 -2.532087
elementType: Cl F O N C H
totalener: -2093.80605922 hartree
nucrepener: 3505.57769214 hartree
electener: -5599.38375136 hartree
oneelecener: -9848.70387792 hartree
twoeener: 4249.32012656 hartree
cpcmener: -0.05698386 hartree
kineticenergy: 2086.79213509 hartree
xcener: -168.848582727322 hartree
chargesum: 0.0000000
charge: -0.063673 -0.161702 -0.158988 -0.161425 -0.277737 -0.264615 -0.497018 -0.498799 -0.456140 -0.461230 -0.045479 -0.099385 0.317897 0.019328 0.014742 0.432416 -0.296987 -0.311870 0.047605 -0.103911 0.375350 -0.156924 0.358805 -0.171516 0.459382 0.039016 -0.188608 -0.101205 0.536050 0.096623 -0.183956 -0.289323 0.113567 0.112870 0.117826 0.108586 0.113882 0.114140 0.141179 0.138969 0.156201 0.130048 0.142045 0.115824 0.143740 0.113039 0.114028 0.137527 0.134306 0.105499
qa: -0.0637 -0.1617 -0.1590 -0.1614 -0.2777 -0.2646 -0.4970 -0.4988 -0.4561 -0.4612 -0.0455 -0.0994 0.3179 0.0193 0.0147 0.4324 -0.2970 -0.3119 0.0476 -0.1039 0.3754 -0.1569 0.3588 -0.1715 0.4594 0.0390 -0.1886 -0.1012 0.5361 0.0966 -0.1840 -0.2893 0.1136 0.1129 0.1178 0.1086 0.1139 0.1141 0.1412 0.1390 0.1562 0.1300 0.1420 0.1158 0.1437 0.1130 0.1140 0.1375 0.1343 0.1055
va: 1.2480 1.1454 1.1517 1.1497 2.1803 2.1520 2.0131 2.0039 2.0571 2.0324 3.1174 3.3758 3.8027 3.6658 3.9764 4.2093 3.9267 3.9429 3.6744 4.1001 4.1823 3.8877 4.1585 4.1221 4.1003 3.9583 3.8605 3.9831 4.4188 3.8387 3.8677 3.9408 1.0034 1.0108 1.0062 1.0091 1.0142 1.0043 1.0317 1.0215 1.0026 1.0075 0.9871 1.0087 1.0083 0.9967 0.9950 0.9999 1.0012 1.0230
dispcorr: -0.028136366 hartree
energy: -2093.834195584474
dipole: 47.94169 -49.40887 -1.46718 5.02930 -6.72533 -1.69603 6.52805 -6.41388 0.11417
magnitude: 2.24547 au
magnitude: 5.70754 debye
