program: Orca
programVersion: 5.0.2
elementType: Cl F F F O O O O O O N N C C C C C C C C C C C C C C C C C C C C H H H H H H H H H H H H H H H H H H
charge: 0
multiplicity: 1
keywords: wb97x-d3
keywords: def2-TZVPP
keywords: def2/J RIJCOSX
keywords: DEFGRID2
keywords: scfconv7
keywords: smallprint printgap noloewdin
keywords: NOSOSCF
formula: C20H18ClF3N2O6
InChI: InChI=1/C20H18ClF3N2O6/c1-5-8-31-17(29)19(2,3)32-16(28)12-9-11(6-7-13(12)21)26-15(27)10-14(20(22,23)24)25(4)18(26)30/h5-7,9-10H,1,8H2,2-4H3
50 atoms
Cl 3.268028 -2.868526 0.419308
F  -6.773462 -0.01468 -1.804079
F  -6.867833 0.276077 0.313659
F  -6.239808 1.889028 -0.979491
O  2.402561 1.262614 -0.308381
O  4.551449 1.207064 1.197904
O  -2.080636 0.243481 1.628028
O  -2.294456 -1.776233 -2.41477
O  5.796843 2.204494 -0.366362
O  3.717913 -0.367921 -1.08673
N  -2.184538 -0.738791 -0.402656
N  -3.995772 0.505446 0.432454
C  3.393644 2.27893 -0.557442
C  -0.857281 -1.230851 -0.211241
C  -4.725821 0.115375 -0.662803
C  -2.718502 0.018608 0.622309
C  2.884196 3.51426 0.177226
C  3.537029 2.560465 -2.043296
C  1.524622 -0.88953 -0.304441
C  0.225086 -0.412352 -0.466038
C  -2.850007 -1.108493 -1.563813
C  -4.212484 -0.649961 -1.63787
C  4.725075 1.873464 0.074651
C  -0.670628 -2.531289 0.224573
C  2.672631 0.002315 -0.615742
C  1.70393 -2.204236 0.13101
C  -4.514186 1.355854 1.5097
C  0.612314 -3.015517 0.399695
C  -6.166126 0.571559 -0.780062
C  5.701372 0.746013 1.90569
C  5.273033 -0.185482 2.984427
C  4.040501 -0.610816 3.227619
H  3.607554 4.323348 0.086788
H  1.947332 3.850931 -0.266763
H  2.717882 3.319483 1.236259
H  4.169358 3.43343 -2.195421
H  3.967541 1.730769 -2.599528
H  2.55813 2.789927 -2.463489
H  0.055919 0.599339 -0.809625
H  -4.788642 -0.949094 -2.498581
H  -1.519201 -3.16886 0.433429
H  -4.988056 0.761199 2.287582
H  -3.68965 1.908665 1.944264
H  -5.210808 2.091194 1.127995
H  0.761733 -4.02659 0.751125
H  6.243905 1.596521 2.328142
H  6.386437 0.232983 1.224438
H  6.094352 -0.536209 3.600285
H  3.85244 -1.299903 4.040097
H  3.17696 -0.298599 2.654974
elementType: Cl F O N C H
totalener: -2093.80713227 hartree
nucrepener: 3538.30598755 hartree
electener: -5632.11311982 hartree
oneelecener: -9913.82790697 hartree
twoeener: 4281.71478715 hartree
cpcmener: -0.05971769 hartree
kineticenergy: 2086.80372044 hartree
xcener: -168.851112770389 hartree
chargesum: 0.0000000
charge: -0.055914 -0.158610 -0.161195 -0.161760 -0.291650 -0.262601 -0.496756 -0.498943 -0.459832 -0.433864 -0.043832 -0.099249 0.321090 0.030547 0.012303 0.433314 -0.291819 -0.314366 0.067428 -0.133168 0.374665 -0.155066 0.355765 -0.173833 0.426801 0.037266 -0.188278 -0.099296 0.535774 0.088420 -0.177534 -0.303028 0.111318 0.113565 0.117472 0.110271 0.115135 0.115752 0.144994 0.138719 0.157906 0.142450 0.115596 0.128684 0.142063 0.120346 0.110412 0.138166 0.135525 0.118844
qa: -0.0559 -0.1586 -0.1612 -0.1618 -0.2917 -0.2626 -0.4968 -0.4989 -0.4598 -0.4339 -0.0438 -0.0992 0.3211 0.0305 0.0123 0.4333 -0.2918 -0.3144 0.0674 -0.1332 0.3747 -0.1551 0.3558 -0.1738 0.4268 0.0373 -0.1883 -0.0993 0.5358 0.0884 -0.1775 -0.3030 0.1113 0.1136 0.1175 0.1103 0.1151 0.1158 0.1450 0.1387 0.1579 0.1425 0.1156 0.1287 0.1421 0.1203 0.1104 0.1382 0.1355 0.1188
va: 1.2583 1.1521 1.1507 1.1450 2.1375 2.1505 2.0137 2.0032 2.0530 2.0555 3.1197 3.3768 3.7913 3.6533 3.9764 4.2069 3.9254 3.9379 3.6137 4.1275 4.1813 3.8855 4.1736 4.1118 4.1387 3.9603 3.8618 3.9903 4.4206 3.8471 3.8352 3.9437 1.0062 1.0019 1.0110 1.0094 1.0139 1.0029 1.0300 1.0216 1.0020 0.9870 1.0085 1.0082 1.0100 0.9951 0.9974 1.0018 1.0018 1.0127
dispcorr: -0.028691296 hartree
energy: -2093.835823564493
dipole: 38.34358 -41.55448 -3.21090 17.26816 -15.93070 1.33746 12.27484 -10.64918 1.62565
magnitude: 3.83946 au
magnitude: 9.75912 debye
